program: Gaussian 09
title: 000259308
version: EM64L-G09RevD.01
frameworkgroup: C1[X(C16H12O2)]
method: RPBEPBE
basis: SDD
operation: Freq
keyword: #pfreq=noraman
keyword: PBEPBE/SDD
title: #p freq=noraman PBEPBE/SDD
converged: YES YES NO NO
title: Mulliken charges:
elementType: O O C C C C C C C C C C C C C C C C H H H H H H H H H H H H
charge: -0.277450 -0.212554 0.174255 0.203932 0.438075 0.401569 0.079855 -0.477341 -0.479031 -0.456408 0.193335 -0.308817 -0.392738 -0.442738 -0.269135 -0.245136 -0.250405 -0.534015 0.239240 0.238512 0.242870 0.250904 0.249727 0.238651 0.231072 0.228920 0.228299 0.227165 0.227602 0.251786
chargesum: 0.00000
title: Mulliken charges with hydrogens summed into heavy atoms:
elementType: O O C C C C C C C C C C C C C C C C
charge: -0.277450 -0.212554 0.174255 0.203932 0.438075 0.401569 0.079855 -0.238101 -0.240519 -0.213538 0.193335 -0.057912 -0.143011 -0.204087 -0.038063 -0.016217 -0.022106 0.172539
polarizability: 2.99416040e+02 -1.49954911e+01 2.07201597e+02 3.75188372e+00 5.66932270e+00 8.15222393e+01
1716.lowfreq: -7.7765 -0.0009 -0.0008 -0.0005 1.0594 4.3141 52.7556 76.6359 93.3884
frequency: 52.7508 76.6343 93.3866 105.7436 113.5879 185.0198 190.4624 223.5354 238.3771 246.8050 279.4557 326.2958 345.7092 397.1354 423.8361 437.6771 456.5840 482.8880 511.3936 527.4482 572.9076 581.5566 627.2590 636.6940 664.9751 687.1133 728.8644 743.0009 755.4927 798.8067 803.3220 817.9245 843.0267 870.7032 876.7639 949.7675 957.4497 976.4049 979.4258 984.0650 989.5840 1003.4979 1042.5621 1084.2724 1110.0541 1129.6102 1146.9645 1163.5487 1178.4803 1180.2902 1224.4484 1234.2399 1239.8078 1269.6042 1309.7392 1360.2157 1377.4374 1402.7464 1409.4475 1419.2345 1431.6038 1442.1931 1450.8903 1469.8329 1474.7126 1502.6640 1517.1361 1560.2424 1577.9225 1604.1585 1618.3346 1628.1704 2970.4011 2972.3958 3064.0146 3120.3258 3122.7984 3129.8004 3131.5596 3139.4575 3146.3443 3159.6807 3174.4217 3220.3201
redmass: 4.6239 4.9409 3.9709 3.7886 3.2600 3.9031 3.5970 3.5753 1.9072 2.7668 3.2852 4.3392 5.6044 5.3299 4.1028 3.9031 5.3836 4.0695 6.4799 3.2505 6.2198 3.5475 4.8252 3.6827 5.6976 5.8747 2.7214 5.1203 1.4241 3.0791 1.4724 5.2227 1.6761 5.9442 1.6309 1.3451 1.4206 1.9221 1.4593 5.2821 1.3800 4.5105 2.4780 4.1997 1.2569 1.9731 1.3875 1.3075 1.2055 1.2229 2.3767 1.9898 2.2968 1.9328 2.2634 4.1510 5.8438 3.8689 1.8566 2.6483 1.6753 1.2992 2.0827 1.0582 1.0670 3.3998 4.0134 7.1885 6.2894 6.0426 6.2915 6.7796 1.0328 1.0848 1.1046 1.0862 1.0863 1.0913 1.0985 1.0915 1.0987 1.0986 1.0943 1.0929
irintensity: 4.7205 0.7434 1.8459 4.3934 11.1103 3.5255 2.6949 1.5106 1.6783 3.6384 1.6036 0.8387 1.1683 1.2707 1.2495 1.8487 13.2422 3.4216 3.5018 7.1653 7.4153 9.3749 19.3563 3.9900 11.2681 5.0214 1.4421 5.1961 57.7789 3.1158 0.8238 8.6477 72.6202 1.4516 27.6279 0.3527 4.5783 9.1932 0.4549 42.7006 1.9148 15.7685 7.5532 75.3363 0.4169 19.2117 12.0487 8.0960 27.1544 26.5022 177.6949 3.5710 42.1222 17.8862 7.3547 27.6590 32.7610 22.0146 55.7951 6.0177 32.6262 11.7964 26.3234 32.4405 40.7529 36.8944 72.8108 11.8091 122.7393 141.0475 9.1313 8.2478 87.7971 47.7695 39.3965 1.3207 2.1176 16.0389 10.7322 14.3603 35.9145 40.1599 13.6601 5.0998
temp: 298.150 k
press: 1.00000 atm
elementType: 8 8 6 6 6 6 6 6 6 6 6 6 6 6 6 6 6 6 1 1 1 1 1 1 1 1 1 1 1 1
symmnumber: 1
zpe: 606957.8 jmol-1
zpe.correction: 0.231178 hartree
zpe.thermalcorrener: 0.245677 hartree
zpe.thermalcorrenthalpy: 0.246621 hartree
zpe.thermalcorrgfe: 0.189913 hartree
zpe.sumelectzpe: -766.102524 hartree
zpe.sumelectthermal: -766.088024 hartree
zpe.sumelectthermalent: -766.087080 hartree
zpe.sumelectthermalfe: -766.143788 hartree
dipole: -3.4110 3.8149 -1.5014
dipole: 5.3331
quadrupole: -71.0510 -101.3266 -110.7748
quadrupole: -1.9730 0.4818 6.4248
quadrupole: 23.3331 -6.9424 -16.3907 -1.9730 0.4818 6.4248
hfenergy: -766.3337016 hartree
pointgroup: C01 [X(C16H12O2)]
dipole: 1.2646694 1.4860055 0.7713089 debye
polarizability: 296.5847592|15.5769307|207.7192751|23.9205969|1.1338242|83.8358422 unknown
InChI: InChI=1S/C16H12O2/c1-18-15-9-8-12-7-6-11-4-2-3-5-13(11)16(12)14(15)10-17/h2-10H,1H3
charge 0 multiplicity 1
30 atoms
O  3.479684 -1.025748 0.628275
O  0.331048 -2.73958 -1.019815
C  -0.026678 0.166444 0.10287
C  -1.421547 -0.292646 0.073326
C  0.197841 1.595258 0.125829
C  -2.475979 0.665753 -0.190287
C  1.141962 -0.702983 0.1323
C  -0.884913 2.522421 -0.107075
C  -2.169958 2.070557 -0.317406
C  1.503122 2.111419 0.377466
C  2.414356 -0.130823 0.471683
C  -1.818088 -1.63099 0.388138
C  2.593384 1.273442 0.606824
C  -3.837194 0.233591 -0.252602
C  -3.161309 -2.025898 0.355771
C  -4.181533 -1.097548 0.002295
C  1.231879 -2.086141 -0.417496
C  4.828157 -0.490847 0.848582
H  -0.655261 3.594231 -0.122611
H  -2.987108 2.770628 -0.525719
H  1.637569 3.199099 0.409979
H  -1.065659 -2.364567 0.671709
H  3.570561 1.697713 0.849939
H  -4.613034 0.975131 -0.477192
H  -3.425509 -3.059391 0.603555
H  -5.227779 -1.419518 -0.042008
H  2.253301 -2.514331 -0.338851
H  4.888482 0.058192 1.807126
H  5.142463 0.166033 0.015609
H  5.476941 -1.377601 0.889788
