program: Gaussian 09
title: 000259310
version: EM64L-G09RevD.01
frameworkgroup: C1[X(C16H14N2O)]
method: RPBEPBE
basis: SDD
operation: Freq
keyword: #p
keyword: freq=noraman
keyword: PBEPBE/SDD
title: #p freq=noraman PBEPBE/SDD
converged: YES YES NO NO
title: Mulliken charges:
elementType: O N N C C C C C C C C C C C C C C C C H H H H H H H H H H H H H H
charge: -0.304936 -0.458177 -0.673548 0.207139 0.199730 0.274774 0.425236 0.070337 -0.012286 -0.384559 -0.382346 -0.443244 -0.417329 -0.278086 -0.256261 -0.266269 -0.280627 0.232577 -0.777043 0.228068 0.230095 0.236369 0.212286 0.308757 0.228969 0.227511 0.230610 0.231480 0.365356 0.296705 0.255187 0.259902 0.213624
chargesum: 0.00000
title: Mulliken charges with hydrogens summed into heavy atoms:
elementType: O N N C C C C C C C C C C C C C C C C
charge: -0.304936 -0.149421 -0.011488 0.207139 0.199730 0.274774 0.425236 0.070337 -0.012286 -0.156491 -0.152251 -0.206874 -0.205043 -0.049117 -0.028750 -0.035659 -0.049148 0.232577 -0.048330
polarizability: 2.78793068e+02 1.69860770e+01 2.69524346e+02 6.84633010e-01 -4.30789748e-01 8.45503847e+01
1716.lowfreq: -6.0934 -0.0002 0.0002 0.0004 1.7236 6.9855 51.6302 62.7625 74.7441
frequency: 51.6137 62.7544 74.7415 89.0782 101.1510 121.6686 158.6234 209.0877 245.4275 276.1985 296.7521 319.8304 367.4109 372.6107 401.6079 409.1409 429.3588 442.8188 466.5464 489.1747 541.4757 558.9551 572.0241 576.9717 599.7977 615.5450 646.4907 661.6559 682.3742 701.7703 729.9179 761.4099 765.9247 770.4751 783.4167 807.0669 862.2599 875.8604 901.7004 921.2180 947.5030 950.7063 979.3996 986.0371 990.3619 991.1482 1028.3245 1039.7917 1049.0886 1061.9149 1105.8821 1129.7093 1165.7985 1177.1094 1185.7891 1203.4145 1252.6889 1275.8567 1287.2681 1301.9406 1340.1147 1382.5905 1389.5042 1396.8904 1418.9053 1438.6022 1443.1189 1448.3609 1463.0321 1468.6221 1490.8024 1499.8125 1532.5915 1572.6810 1582.0779 1613.4907 1615.5974 1624.3048 1662.7110 2994.3599 3090.8047 3103.4980 3122.9953 3124.1423 3134.8403 3137.9251 3147.8913 3155.2507 3165.0486 3170.8502 3262.6959 3493.6457 3639.5237
redmass: 4.1312 3.3095 1.6228 2.8891 2.5027 4.0998 4.6717 4.8992 4.6993 4.5472 5.0276 4.6480 4.3120 4.0010 1.8068 5.0062 5.0224 3.4273 1.7504 4.7475 3.6700 4.3459 3.2490 3.6605 3.7413 6.5156 1.6903 4.2320 2.7734 4.6681 2.2680 1.6476 1.4895 1.5885 2.5322 1.6291 1.4300 4.3399 3.4061 3.9978 1.4912 1.3962 1.3828 1.3417 4.6709 2.5021 2.9553 1.6222 2.0895 2.1160 2.4946 2.0535 1.6936 1.1401 1.1422 1.6618 1.5207 2.0308 2.3094 2.1135 2.3323 4.1203 1.2284 6.1981 4.2992 2.5118 2.7918 1.0588 3.1368 1.1547 2.4005 2.6729 3.6875 3.4409 7.0623 5.4778 6.0237 5.4911 1.3546 1.0364 1.0994 1.0991 1.0846 1.0851 1.0881 1.0891 1.0946 1.0939 1.1007 1.0973 1.0669 1.0757 1.0843
irintensity: 1.6665 1.7388 2.4674 0.8749 0.9229 1.0808 6.5244 7.2654 0.4175 1.8954 3.4293 3.4513 6.0399 7.2972 21.4895 2.3854 1.6870 8.2184 36.5555 13.9785 2.3807 12.5155 1.2530 7.9303 3.8363 2.5561 51.4256 22.1926 25.2424 6.6966 42.0993 147.7797 46.5146 103.5978 45.2929 1.5102 0.2590 6.0164 1.1825 1.1456 0.4662 1.7147 0.4522 0.0715 7.4760 7.1694 5.6623 18.6162 11.3137 7.3135 4.8634 3.1363 9.6009 0.4846 2.5197 0.8079 24.1830 48.5649 2.1680 21.7621 5.5311 31.9620 60.8941 7.7860 7.3265 67.1875 5.7631 15.8034 79.1778 38.7083 193.1442 141.7034 5.6959 93.7712 17.8761 18.3594 91.2685 131.2041 67.8880 14.4761 12.8297 10.7078 0.3882 8.0717 1.1195 20.3728 31.1595 9.2322 43.9176 36.1126 215.0701 20.1390 35.7638
temp: 298.150 k
press: 1.00000 atm
elementType: 8 7 7 6 6 6 6 6 6 6 6 6 6 6 6 6 6 6 6 1 1 1 1 1 1 1 1 1 1 1 1 1 1
symmnumber: 1
zpe: 687607.0 jmol-1
zpe.correction: 0.261896 hartree
zpe.thermalcorrener: 0.277523 hartree
zpe.thermalcorrenthalpy: 0.278467 hartree
zpe.thermalcorrgfe: 0.219058 hartree
zpe.sumelectzpe: -801.565606 hartree
zpe.sumelectthermal: -801.549978 hartree
zpe.sumelectthermalent: -801.549034 hartree
zpe.sumelectthermalfe: -801.608443 hartree
dipole: 0.0844 1.0070 -1.9887
dipole: 2.2308
quadrupole: -92.5973 -98.1346 -119.5889
quadrupole: 8.8242 -7.5956 2.3032
quadrupole: 10.8429 5.3057 -16.1486 8.8242 -7.5956 2.3032
hfenergy: -801.8275014 hartree
pointgroup: C01 [X(C16H14N2O1)]
dipole: 0.0901202 -0.3660523 0.7925576 debye
polarizability: 285.4619168|-13.1230922|262.5109868|7.5055571|-3.9567824|84.8948947 unknown
InChI: InChI=1S/C16H14N2O/c1-10(19)18-16-14-9-5-3-7-12(14)11-6-2-4-8-13(11)15(16)17/h2-9,18H,17H2,1H3
charge 0 multiplicity 1
33 atoms
O  2.932976 2.567594 -0.794043
N  2.394389 0.676183 0.489156
N  0.420617 2.782423 0.221469
C  -0.758283 -1.348959 0.044875
C  -1.774488 -0.294267 0.012887
C  0.634237 -0.974642 0.078063
C  -1.369751 1.087601 -0.008061
C  1.010259 0.423812 0.180768
C  0.048636 1.450799 0.118076
C  -1.091928 -2.735248 0.019963
C  -3.171561 -0.590489 -0.028181
C  1.624416 -2.011478 0.030561
C  -2.374291 2.09918 -0.114187
C  -0.107626 -3.734137 0.012187
C  1.264331 -3.365095 0.003865
C  -4.13984 0.418327 -0.106387
C  -3.736814 1.779658 -0.16106
C  3.267896 1.643803 0.022828
C  4.690103 1.553908 0.56752
H  -2.141812 -3.041588 -0.001107
H  -3.505895 -1.631325 -0.003072
H  2.685406 -1.748557 -0.038065
H  -2.094174 3.155558 -0.184074
H  2.8062 -0.011871 1.126331
H  -0.395358 -4.790514 -0.007083
H  2.040634 -4.136923 -0.042115
H  -5.203204 0.157653 -0.136566
H  -4.485388 2.574284 -0.247688
H  1.349262 3.043837 -0.153718
H  -0.296713 3.499552 0.27913
H  4.897283 2.438038 1.195833
H  5.394375 1.583994 -0.28074
H  4.884005 0.645185 1.163834
