program: Gaussian 09
title: 000259291
version: EM64L-G09RevD.01
frameworkgroup: C1[X(C16H13ClO2)]
method: RPBEPBE
basis: SDD
operation: Freq
keyword: #p
keyword: freq=noraman
keyword: PBEPBE/SDD
title: #p freq=noraman PBEPBE/SDD
converged: YES YES NO NO
title: Mulliken charges:
elementType: Cl O O C C C C C C C C C C C C C C C C H H H H H H H H H H H H H
charge: -0.051688 -0.289040 -0.255176 0.525944 0.524491 0.233397 -0.324281 -0.387412 -0.402424 -0.320867 -0.364089 -0.347537 -0.381302 -0.396760 -0.218755 -0.223704 0.166717 -0.114744 -0.500718 0.217654 0.226098 0.229605 0.220060 0.269422 0.271606 0.229766 0.234875 0.255427 0.257118 0.242527 0.242478 0.231310
chargesum: 0.00000
title: Mulliken charges with hydrogens summed into heavy atoms:
elementType: Cl O O C C C C C C C C C C C C C C C C
charge: -0.051688 -0.289040 -0.255176 0.525944 0.524491 0.233397 -0.106627 -0.161314 -0.172819 -0.100807 -0.094668 -0.075932 -0.151536 -0.161885 0.036673 0.033414 0.166717 -0.114744 0.215598
polarizability: 5.04576580e+02 -5.86857466e+00 1.74196621e+02 -1.24434474e-02 1.67596336e-02 7.60561848e+01
1716.lowfreq: -2.8512 -2.4913 0.0002 0.0009 0.0016 6.3494 21.0878 25.8662 42.7047
frequency: 21.0838 25.8607 42.7047 53.2682 70.0825 100.3400 122.5840 123.1831 150.3786 161.0194 183.2605 219.9095 287.6284 302.0787 316.5034 341.9200 348.0622 407.5635 409.0422 425.3661 456.7328 480.1639 492.9724 531.9947 622.1710 625.6184 634.2670 678.3427 678.5804 712.7164 759.3036 761.5903 819.2580 820.3509 823.8144 850.1317 858.0427 865.6050 904.6578 922.3425 951.4914 964.7131 980.1752 994.2819 995.8644 998.9110 1007.6352 1068.6727 1074.5482 1111.1141 1114.1061 1119.6445 1148.5418 1187.5573 1189.0322 1202.1537 1244.2535 1262.6230 1289.5954 1296.2133 1313.0912 1329.4115 1374.1458 1390.5522 1406.2351 1422.7718 1424.6805 1452.0554 1464.0417 1478.3180 1503.2104 1561.7301 1572.7170 1594.4058 1614.3873 1619.6294 1645.6318 3003.3007 3092.7760 3103.7781 3104.2580 3127.1704 3131.4504 3139.2928 3143.5129 3146.9931 3162.5793 3169.1631 3172.6461 3177.5928
redmass: 4.5373 5.7819 6.7682 5.5272 4.3823 1.3705 2.4567 5.4886 7.4234 3.5283 3.8250 6.6155 4.9183 3.5766 5.1225 7.6657 5.0628 2.8601 2.8562 7.2796 5.7090 2.7945 4.8598 2.9925 7.0985 7.1266 7.0126 4.1034 6.4099 3.2469 5.7444 3.6013 5.5578 1.3969 1.3822 1.3010 1.6569 4.1078 2.0586 8.1311 1.3641 1.3780 1.2522 1.3254 4.0204 1.3173 3.1169 4.5496 2.8437 1.4025 1.2641 1.4514 1.4722 1.1423 1.1447 2.7087 1.5665 2.8817 1.9415 1.4831 1.5904 1.3816 4.1685 3.8115 3.2113 2.5457 1.4097 1.0496 1.0520 2.3874 2.7003 7.0673 6.8218 5.8982 6.5233 8.5874 5.4010 1.0296 1.0919 1.0861 1.1044 1.0898 1.0897 1.0875 1.0883 1.1046 1.0963 1.0958 1.0964 1.0948
irintensity: 0.1948 0.2565 0.1523 1.1660 0.3590 1.2183 0.4848 1.3123 0.7181 0.1256 6.7212 0.5432 21.2412 1.2945 9.3114 9.6901 0.3536 0.0007 0.0054 15.6613 1.0965 3.4198 2.1773 32.2685 4.9959 1.0965 0.2613 31.4186 7.5691 8.7114 6.8970 2.0504 10.6058 12.8899 16.5891 9.2329 64.8694 1.9037 1.3475 3.9829 7.5633 0.0080 40.3679 14.8155 43.6589 5.3072 27.8684 319.1944 58.1127 9.6529 0.0520 5.9126 105.7580 61.1049 39.3370 0.8274 175.2235 301.6384 6.5187 0.2219 5.3130 0.3710 15.0425 0.4345 6.5332 13.0133 57.0867 14.0328 15.1474 87.0379 25.0475 18.6372 8.9001 94.0751 264.1867 128.8760 9.8409 55.9310 1.7478 39.0378 27.4069 15.0229 11.6392 5.3381 5.8432 17.8186 6.2598 7.9552 3.8694 2.6322
temp: 298.150 k
press: 1.00000 atm
elementType: 17 8 8 6 6 6 6 6 6 6 6 6 6 6 6 6 6 6 6 1 1 1 1 1 1 1 1 1 1 1 1 1
symmnumber: 1
zpe: 636731.2 jmol-1
zpe.correction: 0.242518 hartree
zpe.thermalcorrener: 0.260012 hartree
zpe.thermalcorrenthalpy: 0.260956 hartree
zpe.thermalcorrgfe: 0.194199 hartree
zpe.sumelectzpe: -1226.680222 hartree
zpe.sumelectthermal: -1226.662728 hartree
zpe.sumelectthermalent: -1226.661784 hartree
zpe.sumelectthermalfe: -1226.728541 hartree
dipole: 0.7094 -1.5601 0.0014
dipole: 1.7138
quadrupole: -124.0473 -106.8443 -123.3748
quadrupole: -15.0367 0.0147 0.0211
quadrupole: -5.9585 11.2445 -5.2860 -15.0367 0.0147 0.0211
hfenergy: -1226.9227399 hartree
pointgroup: C01 [X(C16H13Cl1O2)]
dipole: 0.2815669 -0.6119411 -0.0299067 debye
polarizability: 504.5726458|-4.758653|173.8664908|4.1990918|5.304556|76.3902499 unknown
InChI: InChI=1S/C16H13ClO2/c1-19-16(18)14-8-4-12(5-9-14)2-3-13-6-10-15(17)11-7-13/h2-11H,1H3
charge 0 multiplicity 1
32 atoms
Cl -7.730621 -0.324709 -0.072329
O  5.817427 -0.844404 0.042663
O  5.638811 1.4769 0.162597
C  0.779723 -0.236475 0.019874
C  -3.108522 0.23005 0.005008
C  3.617962 0.109713 0.068759
C  -0.668504 -0.48058 -0.00745
C  1.359884 1.067031 0.096178
C  1.663304 -1.356026 -0.031327
C  -1.658565 0.467951 0.032196
C  2.751829 1.236301 0.12015
C  3.059199 -1.192193 -0.007624
C  -3.694012 -1.069107 -0.074129
C  -3.987577 1.351104 0.059595
C  -5.090569 -1.24193 -0.09778
C  -5.388622 1.196847 0.036954
C  5.085593 0.349725 0.097343
C  -5.92247 -0.103458 -0.041882
C  7.288952 -0.684539 0.065847
H  -0.954335 -1.540524 -0.065251
H  0.717218 1.952624 0.137409
H  1.238827 -2.365698 -0.090447
H  -1.369098 1.526715 0.09037
H  3.199541 2.23392 0.178781
H  3.726279 -2.057458 -0.047311
H  -3.057887 -1.959118 -0.118653
H  -3.565572 2.361373 0.121004
H  -5.529371 -2.242142 -0.158737
H  -6.04998 2.066762 0.079723
H  7.60481 -0.179828 0.994487
H  7.622852 -0.086805 -0.799098
H  7.684092 -1.708922 0.016679
