program: Gaussian 09
title: 000259314
version: EM64L-G09RevD.01
frameworkgroup: C1[X(C20H23NO)]
method: RPBEPBE
basis: SDD
operation: Freq
keyword: #p
keyword: freq=noraman
keyword: PBEPBE/SDD
title: #p freq=noraman PBEPBE/SDD
converged: NO YES NO NO
title: Mulliken charges:
elementType: O N C C C C C C C C C C C C C C C C C C C C H H H H H H H H H H H H H H H H H H H H H H H
charge: -0.474861 -0.185562 -0.201340 -0.444989 0.289603 0.249794 0.229368 -0.729590 0.169139 0.468550 -0.325835 -0.300378 -0.412912 -0.399276 -0.359349 -0.466776 -0.670503 -0.679296 -0.280381 -0.265937 -0.259537 -0.250271 0.197319 0.241328 0.228704 0.295005 0.208853 0.202902 0.214244 0.200977 0.229054 0.225473 0.220611 0.249780 0.360635 0.224537 0.224058 0.213847 0.209921 0.230158 0.215568 0.225955 0.227689 0.225766 0.227951
chargesum: 0.00000
title: Mulliken charges with hydrogens summed into heavy atoms:
elementType: O N C C C C C C C C C C C C C C C C C C C C
charge: -0.114226 -0.185562 -0.004020 0.025043 0.289603 0.249794 0.229368 -0.434585 0.169139 0.468550 0.085921 0.114843 -0.183857 -0.173802 -0.138738 -0.216995 -0.008061 -0.023650 -0.054426 -0.038247 -0.033770 -0.022320
polarizability: 3.03803237e+02 3.15764944e+01 2.85884642e+02 -1.71325067e+01 1.23650980e+01 1.31260057e+02
1716.lowfreq: -5.7566 -0.0009 -0.0005 0.0006 4.7923 9.5686 27.0433 29.1958 43.8624
frequency: 26.7044 29.1156 43.8144 66.6586 79.0288 84.3390 98.4200 111.4745 146.6313 154.6562 179.2905 211.9738 233.7737 244.4683 246.6892 278.9612 292.8698 313.6516 341.7389 384.1164 403.2801 419.4512 435.5528 442.9167 454.8300 477.2609 495.9747 519.4049 562.2482 569.9969 595.2812 615.5908 631.6857 669.2705 706.9280 735.9941 748.4504 761.0168 763.2041 771.8863 791.8369 797.1239 805.0887 813.3187 856.0135 870.5221 879.8311 886.9545 912.5796 943.1790 950.6287 967.1074 984.5163 986.0215 990.8534 991.2678 1007.1890 1025.2161 1040.9876 1048.8700 1061.3038 1071.5767 1075.0709 1088.2502 1105.4836 1110.8176 1152.6469 1158.0975 1176.6696 1181.4173 1198.8145 1205.1675 1243.6678 1251.7687 1253.2188 1268.3888 1279.2142 1287.0170 1290.3146 1310.9079 1326.7588 1342.2660 1361.9896 1366.5347 1378.3127 1391.0376 1392.7486 1395.1726 1400.6145 1411.8401 1436.5467 1446.7071 1452.4618 1455.5826 1465.4809 1470.3882 1474.7077 1478.3245 1484.8958 1490.6552 1497.0427 1533.7560 1578.2056 1610.1202 1619.8708 1630.0047 2895.2585 2903.9281 2912.8099 2955.5249 2984.8819 2986.9030 3027.9927 3041.4457 3068.6023 3078.8052 3082.6828 3090.0508 3091.9099 3122.6264 3125.2382 3131.6067 3132.1440 3138.7151 3147.4126 3153.5074 3154.2275 3162.7771 3167.5168
redmass: 3.5703 3.9259 3.4461 2.6766 3.3879 2.1891 3.3798 4.0884 1.8594 3.7011 3.4726 1.3689 1.9242 4.0651 3.4255 2.6433 2.4166 3.7301 4.4741 2.6148 6.4035 3.1597 3.0188 3.1093 4.3326 3.3446 3.2119 2.9471 4.4592 3.3520 5.4807 6.6753 3.2222 4.5032 5.4351 2.4919 1.9709 1.2010 1.4560 1.8023 1.5761 1.1516 1.8503 2.2160 2.8327 1.4347 3.9556 2.1765 2.0434 1.4580 1.4073 1.4783 1.5135 1.8419 1.4183 7.1902 4.4989 2.4383 2.0388 2.3393 2.4683 3.0805 2.1793 2.0643 2.2944 1.9310 1.4368 1.6209 1.0711 1.1022 2.1112 1.4525 1.5512 1.7394 2.0430 1.2981 1.1419 1.6222 1.2254 1.9205 1.3060 1.2769 1.3267 1.4640 2.8985 1.2320 1.8292 1.2681 4.4242 2.2041 2.4949 2.6087 2.0087 1.3716 1.0512 1.0536 1.0543 1.0478 1.0740 1.0780 3.1558 3.9146 7.5349 5.8645 6.4752 7.0724 1.0706 1.0710 1.0818 1.0670 1.0359 1.0359 1.0895 1.0894 1.0953 1.0986 1.0984 1.1007 1.1004 1.0850 1.0846 1.0634 1.0888 1.0890 1.0945 1.0927 1.0923 1.1007 1.0982
irintensity: 0.2629 0.4610 0.2733 0.9003 1.5631 0.5139 1.2908 0.1741 0.5555 0.6148 2.2574 0.8331 2.4969 1.2265 0.9911 5.4920 0.2185 2.0441 4.3856 6.8235 0.8731 1.1859 8.2689 0.5156 2.3003 0.3709 3.4751 1.8607 11.1118 0.2940 3.3265 4.8521 0.2063 8.0013 1.1977 23.6574 108.1844 29.0099 35.0208 49.9867 4.3149 6.8182 0.1111 15.0733 3.0191 1.0327 8.7105 1.2314 7.2154 9.0980 0.3757 14.1671 0.5351 8.4904 4.2974 2.6004 41.8076 11.0636 9.4278 0.4669 53.2458 46.4250 13.0199 4.4763 8.7090 9.2206 2.5682 20.7323 0.4945 1.0828 31.6079 13.1642 19.8239 21.7740 6.9811 2.6814 8.1532 1.7386 16.6157 6.8180 10.0889 3.3090 0.9318 24.7425 0.7757 25.0308 43.7117 27.5281 3.2018 21.2817 12.2455 4.8905 2.9291 6.5833 5.5889 7.4158 12.4773 2.4866 11.6948 18.4670 21.4898 1.2139 0.3518 4.5679 1.7539 9.8346 39.5252 126.1703 48.2746 50.9118 31.1639 19.8603 14.1134 19.1261 13.7462 41.3737 57.4762 51.2931 34.8983 0.7942 1.2599 293.4688 8.8762 21.7003 18.7992 10.1033 16.2978 58.5873 29.0934
temp: 298.150 k
press: 1.00000 atm
elementType: 8 7 6 6 6 6 6 6 6 6 6 6 6 6 6 6 6 6 6 6 6 6 1 1 1 1 1 1 1 1 1 1 1 1 1 1 1 1 1 1 1 1 1 1 1
symmnumber: 1
zpe: 993595.0 jmol-1
zpe.correction: 0.378440 hartree
zpe.thermalcorrener: 0.398712 hartree
zpe.thermalcorrenthalpy: 0.399656 hartree
zpe.thermalcorrgfe: 0.328644 hartree
zpe.sumelectzpe: -904.310955 hartree
zpe.sumelectthermal: -904.290684 hartree
zpe.sumelectthermalent: -904.289740 hartree
zpe.sumelectthermalfe: -904.360752 hartree
dipole: 2.5371 1.4579 2.3855
dipole: 3.7753
quadrupole: -107.8981 -121.2616 -139.7007
quadrupole: 2.6958 0.8790 -1.8643
quadrupole: 15.0554 1.6919 -16.7473 2.6958 0.8790 -1.8643
hfenergy: -904.6893956 hartree
pointgroup: C01 [X(C20H23N1O1)]
dipole: 0.9802015 -0.4629005 -1.0154239 debye
polarizability: 301.3548696|-34.5462049|281.267082|13.1955031|34.2599968|138.3259845 unknown
InChI: InChI=1S/C20H23NO/c1-3-21(4-2)14-20(22)19-13-15-9-5-6-10-16(15)17-11-7-8-12-18(17)19/h5-13,20,22H,3-4,14H2,1-2H3
charge 0 multiplicity 1
45 atoms
O  2.095321 0.958275 1.567226
N  3.833098 0.186876 -0.273963
C  1.592479 -0.142695 0.752634
C  2.407592 -0.112122 -0.590048
C  0.095385 0.006759 0.511268
C  -0.695471 -1.106896 -0.002213
C  -2.10273 -0.918276 -0.280823
C  -0.513779 1.222732 0.763868
C  -2.72618 0.385108 -0.031771
C  -1.91432 1.448202 0.504654
C  4.498933 1.054713 -1.29116
C  4.612061 -1.040837 0.069421
C  -0.117828 -2.397954 -0.231233
C  -2.849443 -2.025441 -0.790152
C  -4.106161 0.656006 -0.287187
C  -2.502953 2.723401 0.772872
C  4.066235 2.52911 -1.190694
C  5.834411 -0.754624 0.960674
C  -0.877275 -3.465038 -0.725284
C  -2.256847 -3.274646 -1.013559
C  -4.663951 1.914479 -0.021144
C  -3.858112 2.959713 0.515693
H  1.790252 -1.104139 1.278711
H  2.005036 0.70917 -1.206987
H  2.285437 -1.057951 -1.159356
H  0.096116 2.028928 1.18354
H  5.588916 0.990844 -1.123289
H  4.311205 0.669855 -2.321543
H  3.930311 -1.720411 0.614282
H  4.928414 -1.578422 -0.856599
H  0.93876 -2.565903 -0.000168
H  -3.91434 -1.905423 -1.010265
H  -4.752671 -0.125728 -0.697601
H  -1.869314 3.516953 1.185991
H  3.053749 1.037477 1.238272
H  2.978873 2.652384 -1.340127
H  4.318464 2.939119 -0.197047
H  4.582288 3.131219 -1.961117
H  6.56652 -0.09261 0.464218
H  5.519523 -0.271627 1.902355
H  6.354461 -1.698215 1.208568
H  -0.413088 -4.444489 -0.885292
H  -2.856307 -4.104812 -1.402856
H  -5.725193 2.094693 -0.225706
H  -4.299976 3.940141 0.724436
