program: Gaussian 09
title: 000259299
version: EM64L-G09RevD.01
frameworkgroup: C1[X(C18H17NO)]
method: RPBEPBE
basis: SDD
operation: Freq
keyword: #p
keyword: freq=noraman
keyword: PBEPBE/SDD
title: #p freq=noraman PBEPBE/SDD
converged: YES YES NO NO
title: Mulliken charges:
elementType: O N C C C C C C C C C C C C C C C C C C H H H H H H H H H H H H H H H H H
charge: -0.215181 -0.112586 0.228851 0.412042 0.209295 0.422153 0.287314 -0.599543 -0.390921 -0.479867 -0.349639 -0.473684 0.075144 -0.467811 -0.369921 -0.431147 -0.258213 -0.246083 -0.616893 -0.605892 0.287028 0.223685 0.244996 0.290734 0.237302 0.228257 0.227961 0.225999 0.241302 0.229222 0.230835 0.245254 0.199026 0.221997 0.227571 0.196962 0.224451
chargesum: 0.00000
title: Mulliken charges with hydrogens summed into heavy atoms:
elementType: O N C C C C C C C C C C C C C C C C C C
charge: -0.215181 -0.112586 0.228851 0.412042 0.209295 0.422153 0.287314 -0.312514 -0.167236 -0.234871 -0.058905 -0.236381 0.075144 -0.011593 -0.143922 -0.189845 -0.028992 -0.015248 0.049385 0.043092
polarizability: 3.66327527e+02 2.34492464e+01 2.15741822e+02 -1.24487744e+01 7.56844807e+00 1.02179705e+02
1716.lowfreq: -1.1369 -0.0006 0.0006 0.0011 9.5402 10.8824 24.7352 41.5072 59.0582
frequency: 24.6473 41.4514 59.0482 68.2815 102.4970 117.9603 143.9401 162.7668 219.2680 231.3030 233.4384 242.9057 272.5473 289.3015 343.4708 349.8283 397.1705 407.3122 427.2492 442.8196 461.2551 486.4374 507.9029 532.4983 539.0811 549.6030 572.2968 617.3773 654.1217 687.6052 712.5734 735.1855 757.3939 760.5570 799.8411 827.0053 836.5886 850.6767 860.4834 891.2838 895.4304 949.4651 960.3788 975.1335 981.8686 989.6904 993.7052 996.4876 1029.9877 1033.9714 1040.7016 1068.4230 1090.1516 1104.1137 1130.7130 1153.1273 1155.9052 1170.3812 1178.4408 1205.3211 1232.5426 1247.8949 1256.4108 1260.4903 1279.8356 1295.7072 1315.5827 1342.3203 1375.3745 1400.9198 1404.8074 1420.7125 1428.1243 1441.3596 1448.6669 1454.6017 1459.1891 1460.0238 1472.4752 1475.1400 1485.9808 1493.0430 1531.2256 1561.9929 1578.4713 1607.5412 1624.9843 1629.5338 2866.1771 2879.7615 2894.9647 2995.7155 3020.4194 3032.0652 3078.4060 3087.8229 3122.6162 3124.0400 3134.3933 3137.7616 3141.8205 3147.7125 3152.0011 3162.1259 3167.6975
redmass: 4.4060 3.0350 5.1199 3.5259 3.7959 3.9942 4.8285 4.9372 1.2325 3.6590 1.2603 4.2028 2.4650 3.8809 2.1853 3.7670 3.1280 2.7503 3.2223 3.7712 5.0972 5.5072 3.8153 4.4535 2.9156 6.4272 4.1599 4.2987 5.4798 3.7995 5.9457 3.0888 3.3747 1.4834 1.8768 3.2192 1.4631 3.9901 2.1434 1.9952 3.9774 1.4664 1.4801 1.9019 1.6034 1.5367 3.2207 1.4557 2.1754 1.5995 2.2006 2.2473 1.2676 2.2407 1.3992 1.6751 1.4189 1.3353 1.0896 1.9054 2.0057 1.8563 2.3103 1.5660 1.6465 2.7205 2.1002 1.4427 2.6916 3.2949 7.1989 1.1428 2.8493 1.1448 3.8485 1.0870 1.3861 1.5709 1.0573 1.0696 1.0540 3.3905 3.8525 8.1449 7.9052 6.1821 6.6599 6.8651 1.0554 1.0565 1.0642 1.0911 1.0745 1.0753 1.1014 1.1012 1.0864 1.0861 1.0885 1.0915 1.0889 1.0983 1.0934 1.0973 1.0982
irintensity: 0.9603 0.3916 0.8641 1.6195 0.7495 2.2098 2.0927 0.4592 0.6919 4.4051 0.1156 1.2109 0.2836 0.3262 15.1345 0.0011 0.1330 5.1452 7.6199 2.7149 7.8253 2.4186 7.7718 3.6877 0.1495 0.6046 14.7153 12.3003 15.2556 21.5767 0.5684 19.1388 21.0946 38.7379 6.3239 45.4216 60.0140 4.9979 5.1142 9.3060 1.4115 16.8075 12.8069 28.3652 0.6176 2.7938 4.0886 0.3387 37.6650 11.6775 4.9153 4.1276 4.5868 5.1371 14.4721 7.4065 8.2433 14.2876 0.7467 123.8954 1.5378 35.2672 7.2443 7.8938 2.1091 150.1804 11.6937 0.9766 21.4423 8.2847 9.8413 4.9838 11.3620 2.9396 5.6658 7.8586 7.8329 7.9316 6.3674 16.1537 11.5542 41.7323 0.2803 176.1388 75.7198 20.2598 3.1640 15.8068 99.0290 128.3255 156.8835 28.2737 34.2592 30.9894 24.9127 44.0281 0.2896 3.2741 8.4440 0.3427 0.5177 24.2944 41.6485 1.3961 43.3365
temp: 298.150 k
press: 1.00000 atm
elementType: 8 7 6 6 6 6 6 6 6 6 6 6 6 6 6 6 6 6 6 6 1 1 1 1 1 1 1 1 1 1 1 1 1 1 1 1 1
symmnumber: 1
zpe: 786250.5 jmol-1
zpe.correction: 0.299467 hartree
zpe.thermalcorrener: 0.316695 hartree
zpe.thermalcorrenthalpy: 0.317640 hartree
zpe.thermalcorrgfe: 0.253642 hartree
zpe.sumelectzpe: -824.690854 hartree
zpe.sumelectthermal: -824.673626 hartree
zpe.sumelectthermalent: -824.672682 hartree
zpe.sumelectthermalfe: -824.736680 hartree
dipole: -0.9179 -3.0098 0.0424
dipole: 3.1470
quadrupole: -98.7489 -113.1434 -120.8675
quadrupole: -12.8637 -1.0800 2.4904
quadrupole: 12.1710 -2.2235 -9.9476 -12.8637 -1.0800 2.4904
hfenergy: -824.9903215 hartree
pointgroup: C01 [X(C18H17N1O1)]
dipole: -0.299064 -1.1255601 0.4202374 debye
polarizability: 356.9718924|16.3646947|209.8733906|-50.8579471|-29.472346|117.403771 unknown
InChI: InChI=1S/C18H17NO/c1-19(2)12-18(20)15-9-10-17-14(11-15)8-7-13-5-3-4-6-16(13)17/h3-11H,12H2,1-2H3
charge 0 multiplicity 1
37 atoms
O  3.295655 2.221213 -1.64212
N  4.438896 -0.836183 -0.276743
C  -1.009157 -0.141117 -0.189579
C  -0.686273 1.21918 -0.557171
C  -2.38867 -0.473436 0.173274
C  -3.390915 0.566106 0.152545
C  1.675284 0.590625 -0.917526
C  0.648706 1.555486 -0.912347
C  0.049042 -1.103047 -0.197469
C  -1.723588 2.229158 -0.564174
C  1.357076 -0.756105 -0.550337
C  -3.023238 1.914554 -0.222823
C  3.049273 1.014233 -1.339746
C  4.174401 -0.029081 -1.492428
C  -2.794703 -1.791204 0.550499
C  -4.740515 0.254616 0.503555
C  -4.124077 -2.075353 0.891811
C  -5.108314 -1.045703 0.869024
C  4.848903 -0.002834 0.874898
C  5.403869 -1.923199 -0.549492
H  0.899798 2.583711 -1.197883
H  -0.156054 -2.140332 0.083743
H  -1.450503 3.251989 -0.848067
H  2.166532 -1.490934 -0.506287
H  -3.804151 2.683926 -0.230181
H  5.074326 0.536968 -1.835186
H  3.88505 -0.725521 -2.306327
H  -2.061458 -2.602845 0.577096
H  -5.488762 1.055852 0.482125
H  -4.408281 -3.093993 1.177458
H  -6.145709 -1.27383 1.136551
H  4.062125 0.735699 1.106687
H  5.801868 0.553443 0.694308
H  4.983363 -0.646048 1.762158
H  5.528038 -2.541496 0.357144
H  6.413885 -1.550867 -0.854876
H  5.020276 -2.57193 -1.357712
