program: Gaussian 09
title: 000259290
version: EM64L-G09RevD.01
frameworkgroup: C1[X(C16H12O)]
method: RPBEPBE
basis: SDD
operation: Freq
keyword: #pfreq=noraman
keyword: PBEPBE/SDD
title: #p freq=noraman PBEPBE/SDD
converged: YES YES NO NO
title: Mulliken charges:
elementType: O C C C C C C C C C C C C C C C C H H H H H H H H H H H H
charge: -0.245581 0.259439 0.234475 0.163702 0.447191 0.167203 -0.428257 -0.500620 -0.400547 -0.347139 -0.362346 -0.441292 -0.297753 0.134477 -0.259764 -0.247972 -0.796538 0.315188 0.236902 0.229485 0.218197 0.246963 0.245584 0.231992 0.228807 0.231274 0.236856 0.237358 0.262717
chargesum: 0.00000
title: Mulliken charges with hydrogens summed into heavy atoms:
elementType: O C C C C C C C C C C C C C C C C
charge: -0.245581 0.259439 0.234475 0.163702 0.447191 0.167203 -0.113069 -0.263718 -0.171063 -0.128943 -0.115383 -0.195708 -0.065760 0.134477 -0.030957 -0.016699 -0.059607
polarizability: 2.99280694e+02 -9.08040143e+00 1.94795627e+02 1.30725718e-01 -2.42537890e-04 7.13394734e+01
1716.lowfreq: -0.0003 -0.0001 0.0006 7.4954 10.0869 14.7858 22.5974 52.7819 102.4293
frequency: 21.8089 52.7749 102.4287 150.2887 180.1047 194.7725 229.7189 253.8377 269.0478 317.3741 390.7557 396.8353 434.3605 440.9125 484.5324 503.2509 523.2010 534.9491 557.5936 586.0959 591.6137 640.5298 643.9418 710.7116 733.3688 763.2500 774.2449 793.9016 828.6173 832.3326 860.9467 867.3426 897.0756 926.6183 952.1947 960.0132 986.3945 992.4700 1020.3833 1021.6828 1025.2578 1045.0044 1096.9579 1103.7255 1153.3567 1171.8271 1180.8129 1209.2790 1237.3090 1244.9292 1257.4992 1272.2046 1315.3473 1365.5220 1381.5855 1388.4396 1405.9888 1418.8574 1446.0644 1448.9929 1459.0191 1469.5585 1502.9192 1527.5131 1570.7082 1583.9891 1600.0273 1612.9089 1627.3454 2988.3926 3076.1481 3123.9373 3125.4007 3127.6465 3133.2626 3139.1391 3150.3216 3161.7683 3167.7439 3176.8386 3191.3799
redmass: 4.1562 5.3395 3.9907 3.8285 5.1888 1.0748 3.8367 3.9451 6.3233 3.7364 7.4262 3.2257 4.9506 3.4960 4.9999 3.1560 5.0698 3.1088 6.9034 2.7643 4.8390 3.2310 6.0081 5.6701 2.2452 1.3857 1.5713 5.6565 5.8731 1.7191 1.9004 4.2840 1.8392 1.4547 2.3602 1.3994 1.3799 1.3379 3.5789 1.7179 1.3866 2.2344 2.4784 2.3374 1.5034 1.3663 1.1081 1.5546 1.8868 2.0708 1.9167 1.7041 2.9664 1.2924 4.9595 2.4337 4.6867 2.2638 1.6788 2.3717 1.5092 1.0505 3.3105 4.2933 6.2022 7.1058 5.4885 6.5080 6.5592 1.0373 1.0976 1.0864 1.0992 1.0902 1.0884 1.0872 1.0942 1.0952 1.0958 1.0965 1.0943
irintensity: 4.6865 0.3037 0.4275 0.8327 3.4334 0.4943 4.2764 0.4619 1.7298 1.5456 0.1177 0.7410 2.5195 6.4315 0.4557 6.2366 0.4216 0.1451 2.9354 0.0260 44.0620 2.8055 0.5414 0.0510 5.9201 60.1465 44.4564 1.1450 0.3117 30.2275 25.6378 4.1188 24.9030 0.0561 41.5875 5.0445 1.6262 0.0353 6.9176 1.6809 2.2311 5.2886 16.7259 6.2822 12.3787 1.2598 2.2384 12.0205 5.0121 149.7201 112.2089 7.8920 21.5494 33.9681 5.3901 45.5113 0.7814 7.1191 12.5712 6.5299 8.9182 19.7177 62.6631 14.7206 99.5886 21.9758 5.9765 25.7038 4.1053 3.7933 12.7778 0.5865 15.9350 13.9286 6.8869 11.1705 16.6566 12.1659 40.5050 21.7579 27.1813
temp: 298.150 k
press: 1.00000 atm
elementType: 8 6 6 6 6 6 6 6 6 6 6 6 6 6 6 6 6 1 1 1 1 1 1 1 1 1 1 1 1
symmnumber: 1
zpe: 598774.1 jmol-1
zpe.correction: 0.228061 hartree
zpe.thermalcorrener: 0.241250 hartree
zpe.thermalcorrenthalpy: 0.242194 hartree
zpe.thermalcorrgfe: 0.187542 hartree
zpe.sumelectzpe: -690.998780 hartree
zpe.sumelectthermal: -690.985591 hartree
zpe.sumelectthermalent: -690.984647 hartree
zpe.sumelectthermalfe: -691.039299 hartree
dipole: 0.8678 3.1826 0.0578
dipole: 3.2993
quadrupole: -82.9419 -91.5771 -104.3777
quadrupole: -10.4612 -0.1795 -0.1552
quadrupole: 10.0237 1.3884 -11.4121 -10.4612 -0.1795 -0.1552
hfenergy: -691.2268406 hartree
pointgroup: C01 [X(C16H12O1)]
dipole: -0.2812043 -1.264021 0.0901379 debye
polarizability: 297.5839654|-2.2096289|193.4091758|23.1957795|-9.5032003|74.4226528 unknown
InChI: InChI=1S/C16H12O/c1-11(17)13-7-4-8-15-14-6-3-2-5-12(14)9-10-16(13)15/h2-10H,1H3
charge 0 multiplicity 1
29 atoms
O  3.033743 2.327152 0.263862
C  -0.283434 -0.652724 0.173414
C  0.707517 0.405825 0.19423
C  -1.706036 -0.328547 0.00633
C  -2.098832 1.050152 -0.135568
C  2.111449 0.061795 0.364905
C  0.255796 1.774801 0.045029
C  -1.085011 2.074252 -0.111339
C  0.146739 -2.005452 0.317568
C  -2.735916 -1.320653 -0.022767
C  2.469252 -1.298845 0.503772
C  -3.478044 1.389266 -0.298252
C  1.498955 -2.327343 0.479522
C  3.223035 1.079546 0.403841
C  -4.083475 -0.969801 -0.183047
C  -4.462948 0.396464 -0.322361
C  4.661493 0.593433 0.621709
H  1.007931 2.564029 0.058393
H  -1.399689 3.119127 -0.221838
H  -0.585921 -2.817054 0.302952
H  -2.486138 -2.380722 0.080966
H  3.518533 -1.576329 0.632455
H  -3.750876 2.445804 -0.404672
H  1.807172 -3.372288 0.587939
H  -4.850392 -1.751915 -0.201405
H  -5.51807 0.662257 -0.447412
H  4.991598 -0.081178 -0.189609
H  4.771389 0.051843 1.578772
H  5.314879 1.478604 0.634713
