program: Gaussian 09
title: 000259285
version: EM64L-G09RevD.01
frameworkgroup: C1[X(C14H8Br2)]
method: RPBEPBE
basis: SDD
operation: Freq
keyword: #pfreq=noraman
keyword: PBEPBE/SDD
title: #p freq=noraman PBEPBE/SDD
converged: YES YES NO YES
title: Mulliken charges:
elementType: Br Br C C C C C C C C C C C C C C H H H H H H H H
charge: 0.013275 0.011029 0.206007 0.232457 0.447945 0.588996 -0.453475 -0.519647 -0.274408 -0.373366 -0.438060 -0.417543 -0.255403 -0.261023 -0.220163 -0.251444 0.256698 0.244173 0.229085 0.251831 0.256276 0.234406 0.255749 0.236605
chargesum: 0.00000
title: Mulliken charges with hydrogens summed into heavy atoms:
elementType: Br Br C C C C C C C C C C C C C C
charge: 0.013275 0.011029 0.206007 0.232457 0.447945 0.588996 -0.196777 -0.519647 -0.030235 -0.144281 -0.186230 -0.161267 -0.255403 -0.026617 0.035587 -0.014840
polarizability: 3.15805214e+02 -1.94056073e+01 2.16601658e+02 6.54828766e-03 3.60850212e-03 6.29861536e+01
1716.lowfreq: -0.0008 -0.0003 0.0005 2.8067 8.4235 11.6369 40.0184 93.1858 109.2494
frequency: 40.0126 93.1553 109.2483 121.8216 157.2794 160.3393 192.9955 244.1532 292.3716 326.8169 337.3762 413.2937 416.6844 435.1799 475.1011 509.2870 541.9704 580.9537 606.4147 618.9806 629.1473 718.5959 731.4808 733.7098 776.0187 797.7748 815.9917 842.3105 888.3871 893.6029 895.2882 909.0869 967.0765 970.0591 998.1621 999.2361 1048.3779 1076.8920 1105.3795 1153.7261 1183.6981 1193.6557 1236.9334 1248.2642 1272.3186 1302.2796 1364.0169 1368.4883 1398.7135 1418.1779 1433.3010 1447.3448 1484.1808 1517.4076 1569.9827 1591.6297 1608.2848 1620.2876 3135.4681 3137.9802 3148.8915 3156.0770 3161.7429 3172.6192 3173.8094 3179.9964
redmass: 10.5189 4.1543 12.1359 4.6286 12.6155 5.6264 16.7813 4.1075 8.0958 7.0359 6.0427 3.1726 6.4356 3.2619 5.7076 2.9723 6.0467 4.0446 3.4726 7.3452 8.1184 6.1768 3.1157 6.2156 1.4754 1.8888 1.3753 6.7247 1.4314 1.6318 5.1512 2.0832 1.3812 1.4061 1.3471 7.3748 2.0885 2.4441 2.3493 1.3066 1.0889 1.6376 2.5128 1.7488 1.4607 2.0246 4.0347 2.1589 5.4517 4.9727 2.3845 3.4288 3.2205 4.1526 7.6527 6.6753 7.3128 6.2706 1.0854 1.0897 1.0892 1.0927 1.0946 1.0992 1.0965 1.0912
irintensity: 0.2280 0.5027 0.1213 1.8022 0.3093 0.1110 0.4806 0.6119 6.1083 3.7254 0.6931 1.9419 8.1029 6.2970 0.6540 7.6882 2.8128 8.5413 4.2729 4.3311 0.9937 21.1518 10.5230 9.6551 82.5745 0.0421 21.1096 83.7870 0.3869 42.1927 36.1750 8.3681 2.3685 3.1920 0.0968 29.4130 7.8957 26.9014 1.0522 9.2476 1.2817 10.1283 19.3592 1.3452 0.5806 6.7339 13.7343 12.3877 0.2421 16.3636 28.4551 3.5818 79.6599 9.7259 4.5439 78.4395 2.0308 0.5916 1.2091 5.7961 8.6445 2.4218 12.5803 15.2454 12.4115 6.3212
temp: 298.150 k
press: 1.00000 atm
elementType: 35 35 6 6 6 6 6 6 6 6 6 6 6 6 6 6 1 1 1 1 1 1 1 1
symmnumber: 1
zpe: 449492.6 jmol-1
zpe.correction: 0.171203 hartree
zpe.thermalcorrener: 0.183953 hartree
zpe.thermalcorrenthalpy: 0.184897 hartree
zpe.thermalcorrgfe: 0.129846 hartree
zpe.sumelectzpe: -564.160275 hartree
zpe.sumelectthermal: -564.147524 hartree
zpe.sumelectthermalent: -564.146580 hartree
zpe.sumelectthermalfe: -564.201632 hartree
dipole: -0.3543 0.6318 0.0000
dipole: 0.7244
quadrupole: -115.3554 -93.0830 -117.4967
quadrupole: -5.1340 0.0000 0.0001
quadrupole: -6.7104 15.5620 -8.8517 -5.1340 0.0000 0.0001
hfenergy: -564.3314777 hartree
pointgroup: C01 [X(C14H8Br2)]
dipole: -0.2267275 -0.1726728 -0.0000017 debye
dipolederiv: -0.4752776 0.3650839 0.0000344 0.3949007 -0.4144747 -0.0000058 0.0001504 -0.0001674 -0.0311729 -0.6482687 0.2892549 -0.0000202 0.4685394 -0.2972799 -0.0000362 0.0001603 -0.0001782 -0.0356943 0.2063306 0.0358154 0.0000033 -0.0545924 0.008285 0.0000092 -0.0003838 0.0004206 0.0037019 0.0894815 -0.0209471 -0.0000003 0.1702012 -0.0022957 -0.0000082 0.0000267 -0.0000289 0.0132996 0.0867413 -0.0718307 -0.0000047 -0.2087466 -0.0610835 -0.0000029 0.0001843 -0.0002058 0.0569704 -0.2024797 0.3772019 0.0000028 0.2368954 -0.1683297 -0.0000138 0.0002196 -0.0002395 0.0762434 -0.282874 0.1750314 -0.0000009 0.0426803 -0.1207093 0.0000198 0.0000223 -0.0000234 -0.1058655 0.7286464 -0.7584153 -0.0000374 -0.6003724 0.764536 0.0000069 -0.0003268 0.0003633 -0.1600438 -0.4831131 0.1111124 0.0000286 0.1714706 -0.071891 0.0000071 0.0001572 -0.0001709 -0.0854978 -0.0789184 -0.0837565 -0.0000066 -0.0686714 -0.0282767 -0.0000079 -0.0001448 0.0001598 -0.1357419 0.0760672 -0.0107437 -0.0000036 0.1677125 0.0921784 -0.0000039 -0.0000151 0.0000191 -0.1582531 0.0051839 -0.0451281 0.0000048 -0.1687939 -0.03717 0.0000036 0.0000069 -0.0000088 -0.1475192 1.0337047 -0.5933101 -0.0000068 -0.8001726 0.491494 0.0000222 -0.000187 0.0002075 -0.1316319 -0.0889463 0.0078623 0.000004 -0.0165026 0.1351167 0.0000085 -0.0000326 0.0000356 -0.1546456 -0.2913544 0.2419939 0.0000013 0.2383149 -0.1610559 0.0000025 0.0000903 -0.0000973 -0.1008312 0.1282038 0.0417471 0.0000018 0.0330169 -0.0605046 0.0000155 -0.0000508 0.0000588 -0.1488094 0.0794136 -0.0571483 0.0000008 0.0074378 -0.0419183 -0.0000045 0.0000311 -0.0000357 0.1548072 0.1213505 -0.0411944 0.0000002 0.0054445 -0.042876 0.0000011 -0.0000765 0.0000828 0.1460844 -0.0039333 0.1179874 0.0000042 0.082581 0.0104089 -0.0000021 0.0000479 -0.0000529 0.1440175 0.0602259 0.0319311 0.0000014 -0.0308513 -0.0908575 0.0000028 -0.000035 0.0000369 0.157059 0.0104565 0.0485291 -0.0000044 0.0953344 0.0634392 -0.0000078 0.0001101 -0.00012 0.156825 0.0759533 -0.0296595 0. -0.0572661 -0.1164358 -0.000003 0.0000488 -0.0000555 0.1605173 -0.0439913 -0.0533172 -0.0000022 -0.0421335 0.089405 -0.0000013 -0.0000345 0.0000366 0.1651381 -0.1026023 -0.0780997 -0.0000004 -0.0664269 0.0602954 -0.0000016 0.0000309 -0.0000366 0.1610426 unknown
polarizability: 314.2807697|-22.9234365|218.1261025|-0.0045736|0.0059147|62.9861536 unknown
InChI: InChI=1S/C14H8Br2/c15-10-6-5-9-7-14(16)12-4-2-1-3-11(12)13(9)8-10/h1-8H
charge 0 multiplicity 1
24 atoms
Br -2.973206 2.953699 0.000017
Br 4.669561 -1.71342 -0.000021
C  0.691742 -0.190186 -0.000009
C  -0.681918 -0.701609 -0.000012
C  0.910038 1.232639 0.0000
C  -1.79778 0.222654 -0.000004
C  -0.215829 2.135119 0.000008
C  -1.503329 1.643221 0.000006
C  1.834155 -1.048567 -0.000016
C  -0.971818 -2.100432 -0.000022
C  2.242442 1.748983 0.000003
C  -3.131371 -0.288905 -0.000008
C  3.121469 -0.505401 -0.000013
C  -2.287283 -2.579763 -0.000026
C  3.351679 0.896584 -0.000004
C  -3.377409 -1.666114 -0.000018
H  -0.028139 3.21299 0.000016
H  1.716833 -2.134146 -0.000022
H  -0.152424 -2.824935 -0.000028
H  2.393105 2.834236 0.00001
H  -3.966536 0.4174 -0.000002
H  -2.476409 -3.658411 -0.000033
H  4.370608 1.292632 -0.000002
H  -4.406782 -2.039371 -0.000022
