program: Gaussian 09
title: 000259274
version: EM64L-G09RevD.01
frameworkgroup: C1[X(C12H9N3O2)]
method: RPBEPBE
basis: SDD
operation: Freq
keyword: #p
keyword: freq=noraman
keyword: PBEPBE/SDD
title: #p freq=noraman PBEPBE/SDD
converged: YES YES NO NO
title: Mulliken charges:
elementType: O O N N N C C C C C C C C C C C C H H H H H H H H H
charge: -0.204905 -0.197945 -0.118475 -0.107648 0.022356 0.206091 0.397714 -0.408877 -0.346325 -0.360852 -0.166472 0.177810 -0.291658 -0.332277 -0.197993 -0.201051 -0.229619 0.325917 0.261623 0.289731 0.243985 0.275511 0.258219 0.232960 0.236903 0.235276
chargesum: 0.00000
title: Mulliken charges with hydrogens summed into heavy atoms:
elementType: O O N N N C C C C C C C C C C C C
charge: -0.204905 -0.197945 -0.118475 -0.107648 0.022356 0.206091 0.397714 -0.082960 -0.084702 -0.071122 0.077513 0.177810 -0.016147 -0.074059 0.034967 0.035853 0.005657
polarizability: 3.45429180e+02 -2.47563719e+01 1.77266604e+02 8.57969109e-02 7.69488439e-02 5.85346766e+01
1716.lowfreq: -6.5358 -0.0006 -0.0005 0.0001 2.2048 5.3369 21.7962 42.9781 58.8290
frequency: 21.7469 42.9678 58.8196 67.2155 121.0376 156.9089 162.6701 239.1171 253.4811 299.6639 314.2555 374.5720 405.9134 428.7139 475.1923 491.6066 532.5811 544.0037 554.9434 609.1522 643.0449 676.7821 681.2552 692.5911 708.5464 766.8470 785.0436 822.1523 852.7117 853.9537 934.5181 946.7641 952.5482 964.4528 985.3321 986.2544 990.5590 1002.5878 1005.1259 1014.6112 1059.6826 1076.8877 1080.4263 1143.9297 1162.4180 1172.5932 1174.1283 1210.7722 1225.6254 1274.9669 1306.4977 1365.0453 1376.1072 1389.1610 1395.6833 1436.8117 1446.1342 1457.7480 1467.6430 1577.3427 1581.9182 1602.2805 1607.4562 3132.5609 3144.0069 3152.6160 3156.3117 3168.2776 3171.8995 3174.8594 3184.8834 3189.3489
redmass: 4.2562 10.6229 6.9136 6.1224 5.9777 6.6386 5.6420 8.2405 6.2799 4.9167 4.9389 9.6094 2.8891 3.3582 9.9239 3.6266 7.6824 6.0515 4.5739 6.5485 7.2640 8.4033 2.2451 1.8385 5.8752 10.1046 1.7417 1.4680 6.7187 1.2467 5.3041 1.4124 1.4285 1.4734 6.0823 6.2097 1.3766 1.3582 1.3312 2.0822 1.7166 1.5741 1.4798 2.4040 1.2501 1.0714 1.4690 4.2956 4.6726 1.5032 1.3894 7.8172 10.8804 7.1667 8.0746 3.0721 2.4896 2.6163 2.4277 6.5185 6.1697 6.2841 7.5612 1.0855 1.0889 1.0879 1.0930 1.0958 1.0943 1.1006 1.0914 1.0971
irintensity: 0.1445 0.1057 0.1436 1.6533 0.0176 2.0855 2.1358 2.7295 0.0240 1.0063 0.2092 1.3266 0.0192 0.3003 19.0731 2.0406 3.8013 11.0754 10.0252 0.6597 3.2891 10.9691 3.1240 102.7896 1.2069 22.8530 42.9870 47.2431 2.0955 0.0089 0.8425 1.5765 2.9368 26.2239 0.3311 2.8597 0.0018 1.0848 0.7267 8.8562 30.1145 5.6048 34.2664 31.4860 34.2508 1.1186 4.1582 208.4865 76.5812 1.4918 3.5063 43.1626 99.4703 0.3806 5.2761 20.5531 3.9517 14.9414 19.7631 6.0816 3.1724 12.8261 1.0835 1.0331 8.9913 8.6978 16.2488 12.4759 9.8474 29.5236 6.1392 5.6871
temp: 298.150 k
press: 1.00000 atm
elementType: 8 8 7 7 7 6 6 6 6 6 6 6 6 6 6 6 6 1 1 1 1 1 1 1 1 1
symmnumber: 1
zpe: 493377.4 jmol-1
zpe.correction: 0.187918 hartree
zpe.thermalcorrener: 0.201662 hartree
zpe.thermalcorrenthalpy: 0.202606 hartree
zpe.thermalcorrgfe: 0.145062 hartree
zpe.sumelectzpe: -776.075290 hartree
zpe.sumelectthermal: -776.061546 hartree
zpe.sumelectthermalent: -776.060602 hartree
zpe.sumelectthermalfe: -776.118146 hartree
dipole: 4.2682 3.8024 -0.0075
dipole: 5.7162
quadrupole: -91.4363 -92.0553 -100.9106
quadrupole: -18.1055 0.0140 0.0496
quadrupole: 3.3644 2.7455 -6.1099 -18.1055 0.0140 0.0496
hfenergy: -776.2632078 hartree
pointgroup: C01 [X(C12H9N3O2)]
dipole: -1.5687322 0.4863278 -1.5363307 debye
dipolederiv: -0.9398312 -0.050289 -0.100542 0.0283846 -0.2663375 0.0955859 -0.2751232 0.0727385 -0.4680784 -0.521842 -0.0548168 0.0311173 -0.0010053 -0.3197048 0.2200239 -0.0880968 0.2048871 -0.6975812 -0.01359 -0.0049907 0.0394678 -0.2243695 -0.1538106 0.0302016 0.5416546 0.0955717 -0.1664965 0.7923193 0.1470218 -0.0691579 0.0952055 -0.0768409 -0.0151014 0.0369019 -0.0009232 -0.0832686 1.3379155 0.0396937 0.2556469 -0.123817 0.3695246 -0.4419726 0.6184756 -0.3952014 1.2400566 0.2552207 0.0454662 -0.0337834 0.127842 0.0166714 0.0560524 -0.2206257 0.0317441 -0.1093863 -0.2709604 0.0413434 -0.1872298 0.0353913 0.0006761 0.1274519 -0.1746474 0.1290189 -0.2840739 -0.0413614 -0.0682719 0.158557 -0.0224435 -0.0713106 0.0076397 0.0589059 -0.0061072 -0.0349124 -0.040417 -0.0383632 0.1075846 0.0293519 -0.0808697 -0.0645318 -0.0463078 -0.0846128 0.0614526 -0.1825246 0.0096681 -0.0441942 -0.0545419 -0.0731317 -0.0823232 0.0978218 -0.0630383 0.0665039 -0.1136619 0.0976996 -0.2098501 0.1293797 -0.0780486 -0.0979324 -0.2793293 -0.1067487 0.0166232 -0.5754468 -0.0914094 0.0301581 0.0233733 0.0283893 -0.0111837 -0.2239021 -0.0442707 0.0543057 0.0892174 0.0716618 -0.1056822 -0.0784858 -0.099956 -0.0290726 0.2314926 0.015153 -0.067789 0.1338838 -0.0221948 0.1267664 0.1318496 -0.0901678 -0.043117 -0.2185613 -0.0881998 0.0081723 -0.2644341 -0.0939268 0.1781878 -0.1586735 -0.1426647 -0.062323 0.3256374 -0.0428815 0.0440324 -0.1535256 0.0720514 -0.1633303 0.1224331 -0.0949994 -0.0956027 -0.2781245 -0.1108024 0.0153307 0.0932267 0.0223516 0.0156898 0.0678159 -0.0962926 -0.0630785 -0.0873781 -0.076678 0.0145612 0.1830785 -0.0117759 0.0298214 -0.0223127 0.1533461 0.0305286 0.0526892 0.0336424 0.1104769 0.0930355 0.028679 -0.083096 0.0211269 0.1391459 0.0483723 -0.0661444 0.050642 0.0260218 0.0517593 -0.0185527 0.0052209 -0.0077593 0.1675266 0.0141066 -0.0187976 0.0107456 0.1453276 0.0210512 -0.0458182 0.0621614 -0.051365 0.112827 0.0826846 0.0743409 0.084175 -0.0086702 0.1177247 -0.034165 0.0659435 -0.019519 0.1277419 0.0612817 0.0327932 0.0567753 0.038387 0.0795881 0.0271858 -0.0851041 0.0167623 0.1400326 0.0511111 -0.0615603 0.0541041 0.0198857 -0.0139412 0.0143207 -0.0824034 0.0308493 0.1282137 0.0707314 -0.1194836 0.0659073 -0.0290402 0.0130347 -0.0486211 0.0664744 -0.0639113 0.1140263 0.0874658 0.1009864 0.0920199 -0.0175257 -0.1295192 -0.0339473 -0.0084241 -0.0315613 0.1460133 0.0230014 -0.0136174 0.0223392 0.1056845 unknown
polarizability: 343.8404982|36.6928041|82.4938738|1.4564886|-42.8693714|154.8960888 unknown
InChI: InChI=1S/C12H9N3O2/c16-15(17)12-8-4-7-11(9-12)14-13-10-5-2-1-3-6-10/h1-9H
charge 0 multiplicity 1
26 atoms
O  4.964248 0.033898 1.873759
O  3.006402 -0.655102 2.81603
N  -0.562132 0.48246 -0.750209
N  -1.193218 -0.051804 0.26285
N  3.683556 -0.128977 1.853362
C  0.85881 0.585938 -0.563068
C  2.944895 0.320242 0.639449
C  1.551378 0.154607 0.599532
C  1.57567 1.165486 -1.642749
C  3.680615 0.895852 -0.424552
C  2.977375 1.318178 -1.570988
C  -2.610313 -0.164584 0.101147
C  -3.335847 0.250995 -1.052816
C  -3.29349 -0.741245 1.205021
C  -4.731793 0.084657 -1.087364
C  -4.69369 -0.903788 1.161158
C  -5.414858 -0.491511 0.015937
H  1.007689 -0.292928 1.435419
H  1.010614 1.486555 -2.523534
H  4.764953 0.99871 -0.334843
H  3.52193 1.766322 -2.407704
H  -2.788278 0.692704 -1.890826
H  -2.70559 -1.049775 2.075651
H  -5.297677 0.401219 -1.970531
H  -5.220303 -1.348179 2.012129
H  -6.502746 -0.616528 -0.020762
