program: Gaussian 09
title: 000259276
version: EM64L-G09RevD.01
frameworkgroup: C1[X(C15H16)]
method: RPBEPBE
basis: SDD
operation: Freq
keyword: #p
keyword: freq=noraman
keyword: PBEPBE/SDD
title: #p freq=noraman PBEPBE/SDD
converged: YES YES NO NO
title: Mulliken charges:
elementType: C C C C C C C C C C C C C C C H H H H H H H H H H H H H H H H
charge: -0.340977 -0.349067 -0.486450 -0.689961 0.024035 0.339596 -0.026369 -0.560397 -0.395240 -0.394997 -0.222941 -0.221360 -0.245950 -0.123916 0.097695 0.201668 0.194344 0.222745 0.190345 0.232148 0.228271 0.205365 0.210329 0.218217 0.245692 0.248521 0.257047 0.256584 0.227723 0.227942 0.229358
chargesum: 0.00000
title: Mulliken charges with hydrogens summed into heavy atoms:
elementType: C C C C C C C C C C C C C C C
charge: 0.055035 0.064023 -0.026031 -0.056049 0.024035 0.339596 -0.026369 -0.046766 -0.149548 -0.146476 0.004782 0.006582 -0.016593 -0.123916 0.097695
polarizability: 2.41068120e+02 -2.43530449e+01 1.41432256e+02 -1.39023827e+01 -2.27465832e+01 1.14904272e+02
1716.lowfreq: -28.4048 -11.2283 -5.0667 0.0001 0.0004 0.0005 2.8376 5.0539 23.4365
frequency: -25.1629 -2.5204 22.5375 48.1872 58.6431 88.9182 100.6123 138.4187 201.8111 225.1793 229.3610 245.6236 265.4729 325.2196 358.4291 374.1332 382.9374 402.7427 493.2139 518.5966 539.3935 553.7271 618.3340 698.0168 709.8635 714.2535 752.4642 774.0199 808.2679 854.4262 871.8759 904.6039 926.7267 926.9192 958.9081 979.4158 986.3406 994.2998 996.8871 1028.5226 1057.2068 1078.6531 1095.5557 1107.0733 1158.4948 1172.6580 1186.8079 1198.1172 1209.0517 1230.9620 1267.6447 1285.2865 1298.1801 1309.5606 1311.9494 1321.5175 1354.2501 1368.5966 1388.8272 1433.3235 1442.6667 1454.7527 1461.8939 1473.5471 1478.2872 1482.7476 1485.7094 1575.3872 1609.9705 2270.7686 2285.7493 2953.2878 2966.2818 2969.9697 2972.3271 2977.3533 2991.7726 3013.7810 3020.5991 3043.3655 3069.2631 3072.8330 3126.5017 3135.2185 3148.5773 3157.8590 3168.9043
redmass: 3.2291 3.7212 3.5276 3.0325 2.2126 3.9761 4.0427 2.8342 4.1906 1.2438 2.7720 2.2176 3.6729 4.9371 5.2331 3.7324 5.0442 2.8418 6.9191 4.5868 3.5622 4.3777 6.5862 1.8388 3.3401 2.8846 1.4185 1.7496 1.8726 1.2470 1.4637 1.8211 1.4111 1.4252 4.3320 1.3816 5.5363 3.0700 1.3182 2.0217 2.3970 1.5996 1.5882 2.0032 2.7199 1.0550 1.1116 1.0836 1.3263 1.3100 2.1696 1.1498 1.2320 1.6518 1.4480 1.6594 1.5428 5.5107 1.2135 2.3616 1.0738 1.0868 1.0750 1.0619 1.0425 2.4284 1.0774 5.7715 6.0860 11.8422 11.7208 1.0581 1.0584 1.0493 1.0486 1.0610 1.0984 1.0979 1.0985 1.1033 1.1013 1.0992 1.0846 1.0880 1.0929 1.0969 1.1016
irintensity: 0.0578 0.0018 0.3616 0.0276 0.3580 2.5525 1.9652 4.2551 7.3187 1.7581 3.4806 3.4050 1.5824 1.9637 1.1183 0.1382 0.0728 0.0042 2.2403 1.4265 12.4700 3.6277 0.0614 44.7422 2.5687 9.1246 2.6161 67.2584 0.1213 0.0032 1.0795 0.2327 2.4306 13.4629 0.7217 0.0008 0.2356 1.4237 0.2736 7.2541 0.1839 9.1772 1.7387 1.5894 0.6985 0.0088 0.1322 0.1990 0.7593 0.0430 4.1733 0.7702 0.2359 21.1359 6.8975 28.7750 5.6010 0.0388 11.8964 5.9096 10.0253 11.8309 2.3157 4.2147 12.0664 34.4893 13.7976 2.1668 15.4117 5.7900 3.5323 22.0704 10.9388 38.6302 14.9484 87.9788 5.5705 10.7773 19.5453 24.7673 95.3107 46.7298 1.4106 3.8265 22.4462 33.3947 16.6552
temp: 298.150 k
press: 1.00000 atm
elementType: 6 6 6 6 6 6 6 6 6 6 6 6 6 6 6 1 1 1 1 1 1 1 1 1 1 1 1 1 1 1 1
symmnumber: 1
zpe: 674217.7 jmol-1
zpe.correction: 0.256796 hartree
zpe.thermalcorrener: 0.271014 hartree
zpe.thermalcorrenthalpy: 0.271959 hartree
zpe.thermalcorrgfe: 0.213779 hartree
zpe.sumelectzpe: -579.999808 hartree
zpe.sumelectthermal: -579.985589 hartree
zpe.sumelectthermalent: -579.984645 hartree
zpe.sumelectthermalfe: -580.042825 hartree
dipole: -0.5646 -0.0862 0.0314
dipole: 0.5720
quadrupole: -75.2940 -84.6715 -87.6963
quadrupole: -2.4519 -4.0829 -6.3959
quadrupole: 7.2599 -2.1176 -5.1423 -2.4519 -4.0829 -6.3959
hfenergy: -580.2566035 hartree
pointgroup: C01 [X(C15H16)]
dipole: 0.2126005 -0.0727584 0.0124535 debye
polarizability: 247.1666364|3.0685591|141.5428193|0.249385|22.0011836|108.6951917 unknown
InChI: InChI=1S/C15H16/c1-2-3-4-5-6-7-9-12-15-13-10-8-11-14-15/h8,10-11,13-14H,2-4,7H2,1H3
charge 0 multiplicity 1
31 atoms
C  4.832761 -1.225443 -0.03784
C  3.952249 -2.19546 0.780307
C  4.062554 -0.502871 -1.18111
C  4.73646 -2.893973 1.9117
C  2.980656 0.380909 -0.703559
C  -2.839283 0.547847 -0.344492
C  2.075635 1.117635 -0.302748
C  1.006697 2.01919 0.183128
C  -3.963177 1.194822 0.247589
C  -3.05626 -0.6217 -1.130662
C  -5.263965 0.684861 0.056886
C  -4.359873 -1.125917 -1.316553
C  -5.469256 -0.476497 -0.724965
C  -1.510858 1.062328 -0.155492
C  -0.361714 1.490734 -0.005029
H  5.273663 -0.466768 0.638365
H  5.677679 -1.784388 -0.488896
H  3.096752 -1.635388 1.205071
H  3.520543 -2.957605 0.099574
H  4.77562 0.092273 -1.785886
H  3.631576 -1.263186 -1.863991
H  5.587086 -3.475406 1.507672
H  5.145441 -2.15399 2.625447
H  4.091462 -3.589323 2.479413
H  -3.80292 2.093579 0.852618
H  -2.195951 -1.122147 -1.587472
H  1.091713 2.999053 -0.33129
H  1.168833 2.231065 1.260403
H  -6.118847 1.192357 0.517682
H  -4.512147 -2.025676 -1.923152
H  -6.48103 -0.870514 -0.87132
