program: Gaussian 09
title: 000259269
version: EM64L-G09RevD.01
frameworkgroup: C1[X(C13H7Cl2NO)]
method: RPBEPBE
basis: SDD
operation: Freq
keyword: #p
keyword: freq=noraman
keyword: PBEPBE/SDD
title: #p freq=noraman PBEPBE/SDD
converged: YES YES NO YES
title: Mulliken charges:
elementType: Cl Cl O N C C C C C C C C C C C C C H H H H H H H
charge: -0.006794 -0.011299 -0.156382 -0.692311 0.439642 0.331682 0.239795 0.217050 -0.321092 -0.308640 -0.692608 -0.401355 0.714367 -0.416529 -0.432657 -0.217978 -0.234878 0.281641 0.270661 0.279653 0.231288 0.236434 0.325432 0.324877
chargesum: 0.00000
title: Mulliken charges with hydrogens summed into heavy atoms:
elementType: Cl Cl O N C C C C C C C C C C C C C
charge: -0.006794 -0.011299 -0.156382 -0.042002 0.439642 0.331682 0.239795 0.217050 -0.321092 -0.308640 -0.410967 -0.130693 0.714367 -0.136877 -0.432657 0.013311 0.001556
polarizability: 2.90178349e+02 -1.95040689e+01 2.04933588e+02 2.79496281e-02 -9.67032238e-03 6.15908137e+01
1716.lowfreq: -1.6321 -0.0033 -0.0018 0.0008 5.1349 5.3689 55.6118 75.6873 105.8775
frequency: 55.6093 75.6857 105.8773 143.4199 144.9493 201.7456 202.4505 252.5817 264.3505 272.6279 314.1941 317.8169 341.1268 410.2750 416.3606 425.3081 476.3384 485.2587 504.2327 532.2405 534.8521 587.4464 620.8871 638.5102 673.0698 710.1821 750.7695 757.9170 781.6388 795.7273 825.8876 880.0867 896.8180 918.4182 970.4465 997.3785 1000.4344 1012.0270 1038.5818 1059.5150 1085.3823 1138.4341 1169.4567 1197.9305 1204.8361 1289.5612 1312.2911 1365.1869 1381.6161 1437.1434 1450.4557 1469.1784 1485.2452 1557.4482 1591.6308 1606.7702 1623.0480 1632.9466 1647.4096 3134.4375 3144.3724 3148.0671 3165.4843 3182.2491 3551.1736 3697.8483
redmass: 9.1160 8.5941 5.9941 6.5125 8.1405 4.8642 28.7716 10.3742 6.0877 5.6948 8.0718 8.9602 4.5806 9.1523 1.8633 1.6078 1.1785 4.4069 4.7277 7.1702 5.0647 6.8930 5.2877 8.3863 6.5133 4.9639 6.9751 1.5922 3.3143 9.0197 2.5819 7.7486 1.4379 1.9574 1.4648 1.3575 4.6609 3.6298 2.4052 1.7941 2.2551 2.5463 1.2125 2.2191 2.4875 1.5450 3.9614 6.5203 3.9662 2.8144 2.7497 5.8302 5.7466 9.4968 6.9199 7.8338 2.0578 2.9392 4.3887 1.0862 1.0926 1.0914 1.0978 1.0959 1.0456 1.1037
irintensity: 3.6252 1.5893 2.1512 0.0603 2.3931 0.0822 0.1216 2.6103 7.1567 2.1751 3.8921 3.0631 5.6094 3.8310 39.2529 25.4987 233.6350 0.4637 3.3665 1.8011 1.1520 10.1752 0.7233 10.0936 0.5965 17.1114 17.1076 70.0507 16.6839 9.3721 0.1254 51.0983 9.5380 21.8582 7.2103 0.0002 2.3734 46.6121 27.1077 26.2665 41.3487 12.3095 1.6250 29.5794 5.7670 7.1851 40.3977 22.8473 16.1796 7.4236 4.9579 202.3812 126.4563 2.0209 80.3732 178.9660 118.4727 154.0722 198.2887 3.7204 5.0457 8.5061 26.1115 8.5288 151.7366 38.5549
temp: 298.150 k
press: 1.00000 atm
elementType: 17 17 8 7 6 6 6 6 6 6 6 6 6 6 6 6 6 1 1 1 1 1 1 1
symmnumber: 1
zpe: 431030.3 jmol-1
zpe.correction: 0.164171 hartree
zpe.thermalcorrener: 0.177974 hartree
zpe.thermalcorrenthalpy: 0.178918 hartree
zpe.thermalcorrgfe: 0.123396 hartree
zpe.sumelectzpe: -1548.544744 hartree
zpe.sumelectthermal: -1548.530941 hartree
zpe.sumelectthermalent: -1548.529997 hartree
zpe.sumelectthermalfe: -1548.585519 hartree
dipole: -1.7412 0.1099 0.0101
dipole: 1.7447
quadrupole: -89.6647 -109.2594 -115.3205
quadrupole: -21.0335 -0.0446 0.0234
quadrupole: 15.0835 -4.5112 -10.5723 -21.0335 -0.0446 0.0234
hfenergy: -1548.7089148 hartree
pointgroup: C01 [X(C13H7Cl2N1O1)]
dipole: -0.6850623 0.0426621 -0.0039732 debye
dipolederiv: -0.0585991 -0.0690613 0.0000095 0.0775531 -0.677918 0.0000922 -0.0001027 0.0001485 -0.0329082 -0.6217518 0.306554 -0.0001013 0.353854 -0.2609686 -0.0000395 -0.0001168 0.0000411 -0.0225363 -0.5545689 0.1192446 0.0000924 0.1453964 -1.1044143 -0.0005517 -0.0000364 0.0004138 -0.2993186 -1.6338237 -0.5888301 0.0021396 -0.6319546 -0.3774122 0.0002658 0.0069124 0.0024206 -0.6921859 -0.3637873 -0.1471762 0.0002787 0.0030523 -0.4385309 0.0001035 0.0005249 0.0000729 -0.0184297 0.6905197 0.1822481 -0.0001995 0.1871612 0.1237215 0.0000148 -0.0004957 -0.0001639 0.0041778 -0.5362749 0.4951152 -0.0000789 0.1879667 0.0669366 -0.0000581 0.0002617 -0.0002467 0.0624258 -0.6886156 -0.2779601 -0.0000661 -0.1122937 -0.3209169 -0.0000999 -0.0000762 -0.0001091 0.0348352 1.3343733 -0.0944884 -0.0000767 -0.0427744 1.3031601 0.0005933 -0.0002193 -0.0000012 0.1039578 0.3231312 0.087945 -0.0003058 0.0736154 1.0091496 -0.000278 -0.000352 -0.0000943 -0.0020189 -0.28565 -0.3809628 0.0002525 0.3069597 0.1094029 -0.0000176 -0.0002955 -0.000186 -0.1920816 -0.448554 -0.230802 -0.0000155 -0.2278772 -0.0388905 0.0000304 0.0000259 0.0000413 -0.1511907 1.3946984 0.7534155 -0.0018808 0.8657854 0.1729696 -0.0005144 -0.002542 -0.0006754 0.1718233 0.201889 0.0527651 0.0000347 -0.1223486 0.1361281 0.0000565 0.000037 0.0000366 -0.115588 0.4307342 -0.443573 0.0003132 -1.2167275 -0.0078451 0.000274 0.0006851 -0.0000811 -0.1247704 0.2027025 0.1443116 0.0000473 0.0838068 0.1051206 0.0000388 0.0000999 0.0000593 -0.1232635 -0.0019792 0.0002783 0.000091 -0.0133176 -0.1500961 -0.0000326 0.0000614 -0.000025 -0.1805267 0.0593926 -0.0157685 0.0000534 -0.0485214 -0.0215589 -0.0000712 0.0001503 0.0000154 0.1747199 0.0948065 0.0711219 0.0000019 0.0402104 -0.010104 -0.0000251 0.0000613 -0.0000317 0.1610686 0.0694296 0.0284081 -0.0000089 0.0878785 -0.0143726 -0.0000217 -0.0000032 -0.00005 0.1590379 0.0011529 -0.0878167 -0.0000229 -0.1219826 -0.0506238 -0.0000385 -0.0000876 -0.0000584 0.1531777 -0.1368909 -0.0009096 -0.0000427 0.0060112 0.0912832 -0.0000015 -0.0000762 0.0000237 0.1672017 0.3038142 0.037411 -0.0003469 -0.0145893 0.1701389 0.0005449 -0.0027132 -0.0002124 0.3774375 0.2238516 0.0585302 -0.0001682 0.1331359 0.185641 -0.0002642 -0.0017034 -0.0013381 0.3849554 unknown
polarizability: 293.6823038|8.3328975|201.4296324|-0.0289385|-0.006104|61.5908137 unknown
InChI: InChI=1S/C13H7Cl2NO/c14-11-9(16)5-8-10(12(11)15)6-3-1-2-4-7(6)13(8)17/h1-5H,16H2
charge 0 multiplicity 1
24 atoms
Cl -1.127439 2.987178 -0.000173
Cl -4.083905 1.692917 0.000465
O  1.09977 -3.026014 -0.000011
N  -4.11547 -1.320948 0.002484
C  -0.185668 0.345509 -0.000062
C  1.283275 0.583113 -0.000166
C  -0.416627 -1.066924 -0.000065
C  1.940774 -0.689344 -0.000247
C  0.913796 -1.777868 -0.000947
C  -1.314196 1.180145 0.0002
C  -1.684938 -1.640495 0.000197
C  2.056379 1.760235 0.000094
C  -2.836051 -0.791842 0.000856
C  3.338614 -0.805359 0.000058
C  -2.615595 0.619621 0.000663
C  3.472999 1.643792 0.000318
C  4.113819 0.381787 0.000312
H  -1.793992 -2.730468 0.000002
H  1.587141 2.746595 0.000243
H  3.806048 -1.795638 -0.00005
H  4.081458 2.555243 0.000561
H  5.207335 0.325988 0.000484
H  -4.926697 -0.706966 -0.001552
H  -4.255529 -2.326857 0.000537
