program: Gaussian 09
title: 000259260
version: EM64L-G09RevD.01
frameworkgroup: C1[X(C8H7FINO)]
method: RPBEPBE
basis: SDD
operation: Freq
keyword: #p
keyword: freq=noraman
keyword: PBEPBE/SDD
title: #p freq=noraman PBEPBE/SDD
converged: NO YES NO YES
title: Mulliken charges:
elementType: I F O N C C C C C C C C H H H H H H H
charge: 0.116249 -0.198523 -0.246528 -0.450657 0.550493 -0.404282 -0.508635 -0.261301 0.391762 -0.356521 0.225711 -0.796943 0.245940 0.339549 0.319160 0.281442 0.239980 0.273184 0.239921
chargesum: 0.00000
title: Mulliken charges with hydrogens summed into heavy atoms:
elementType: I F O N C C C C C C C C
charge: 0.116249 -0.198523 -0.246528 -0.131497 0.550493 -0.158342 -0.169086 -0.261301 0.391762 -0.075079 0.225711 -0.043858
polarizability: 1.95077112e+02 1.84753350e+00 1.24137789e+02 -1.92183078e-03 -2.23851620e-04 4.71301463e+01
1716.lowfreq: -51.5668 -6.2265 -5.3224 -0.0001 0.0003 0.0005 8.3049 53.6548 82.7586
frequency: -51.5276 53.6522 82.7090 102.7612 147.8150 170.4929 203.0133 228.8669 252.7248 299.9837 353.8503 453.7815 503.3324 523.2320 523.7743 561.5786 603.0469 646.7950 677.1359 679.8552 780.7134 845.2622 857.4293 915.0078 924.3425 952.7515 976.7865 1012.5941 1034.2415 1099.2478 1133.0752 1223.4659 1254.7188 1275.0758 1375.7446 1380.7473 1404.3291 1449.4499 1456.8208 1468.8264 1506.5258 1582.1562 1609.0220 1638.5033 2989.6923 3074.8044 3140.4774 3148.7155 3194.0078 3202.5685 3527.1954
redmass: 1.0799 7.1436 3.8046 6.2873 5.8626 9.4904 18.9357 5.1812 3.9046 4.2895 6.6282 5.3637 8.8414 4.8957 4.2278 3.3750 3.1845 1.2784 6.0024 2.1697 7.9737 1.4768 1.5607 1.4115 5.4326 2.6744 5.9679 2.0865 1.6592 1.5528 1.7825 2.7968 1.3192 2.5340 4.0810 1.3576 3.9050 1.1458 3.6406 1.0462 2.0460 5.5352 6.9787 5.2207 1.0386 1.0984 1.0979 1.0926 1.0939 1.0938 1.0766
irintensity: 0.0213 7.4618 3.4265 2.7102 0.4035 1.6098 0.3232 0.4659 1.0302 3.4744 4.5636 1.7027 3.8214 0.0001 24.0932 1.8406 0.5296 79.1576 2.3395 22.9641 61.1035 33.9363 24.8311 49.6361 19.8782 17.9474 11.4625 53.1562 8.4304 6.5303 31.2864 148.8134 39.1610 2.2926 84.5291 75.7251 84.9827 47.4940 157.9677 20.8909 254.4228 281.9103 200.5758 119.9176 6.4343 13.3971 6.1765 5.8751 2.6747 23.8984 14.5957
temp: 298.150 k
press: 1.00000 atm
elementType: 53 9 8 7 6 6 6 6 6 6 6 6 1 1 1 1 1 1 1
symmnumber: 1
zpe: 349923.9 jmol-1
zpe.correction: 0.133279 hartree
zpe.thermalcorrener: 0.144251 hartree
zpe.thermalcorrenthalpy: 0.145195 hartree
zpe.thermalcorrgfe: 0.094136 hartree
zpe.sumelectzpe: -549.522611 hartree
zpe.sumelectthermal: -549.511640 hartree
zpe.sumelectthermalent: -549.510695 hartree
zpe.sumelectthermalfe: -549.561754 hartree
dipole: 0.0601 -5.1238 0.0000
dipole: 5.1241
quadrupole: -86.4164 -80.7508 -86.4625
quadrupole: -16.9754 -0.0001 0.0000
quadrupole: -1.8732 3.7924 -1.9193 -16.9754 -0.0001 0.0000
hfenergy: -549.6558902 hartree
pointgroup: C01 [X(C8H7F1I1N1O1)]
dipole: -0.6684113 1.9019416 0.0038356 debye
dipolederiv: -0.3108389 -0.214493 -0.0007126 -0.2612858 -0.2091059 -0.0006964 -0.0007819 -0.0006506 0.0068719 -0.2815247 0.1404638 0.0002272 0.1494245 -1.1185366 -0.002102 0.0002945 -0.0020868 -0.1529691 -0.7795963 0.002212 -0.0003105 -0.551153 -0.8737357 -0.0016019 -0.0015197 -0.0012199 -0.333243 -2.0928738 -0.0900252 -0.0014915 -0.1693488 -0.3695474 -0.0002052 -0.0016411 -0.0001432 -0.3334753 1.2992325 -0.1849777 0.0004478 -0.390456 0.3053399 0.0000978 0.0000453 0.0002637 0.136925 -0.7352048 -0.0576398 -0.0005428 -0.3852684 -0.1951964 -0.0003042 -0.0013162 -0.0000585 -0.1854838 -0.4304744 0.1425029 0.0001393 0.2337655 -0.3106009 -0.0001119 0.000326 -0.0002034 -0.1830203 0.9133195 0.4614342 0.0018139 0.5573506 0.6682741 0.0022561 0.0020533 0.002194 -0.1357283 0.6269345 -0.0296499 0.0003162 -0.2240172 1.3023692 0.0025434 -0.0001697 0.0026761 0.120689 -0.4680348 -0.3916077 -0.0011466 -0.1123362 -0.5374891 -0.0010019 -0.0005052 -0.0012024 -0.1377465 2.0392361 0.0958391 0.0015394 0.8177452 1.1094928 0.002705 0.0030199 0.0021863 0.1770598 -0.3569 0.1550605 0.0000418 0.2969425 -0.1786121 -0.0003721 0.0005792 -0.0005802 0.0540033 0.074919 0.0598762 0.0000528 0.0664688 -0.0397835 -0.000445 0.0000616 -0.0004638 0.1775218 0.19575 -0.0505364 -0.0001268 -0.0134591 0.1210983 -0.0002041 -0.0000347 -0.0002301 0.2068799 0.1755749 -0.0269257 -0.0001567 0.0050205 0.1013219 -0.0004588 -0.0000837 -0.0004478 0.3078403 0.0281325 0.0429891 -0.0000123 0.031147 0.1064147 -0.0001766 -0.0001105 -0.0001927 0.1921232 0.0642615 -0.0056273 -0.0472314 0.0278568 0.0347011 -0.0979618 0.0030177 -0.108782 -0.0266997 -0.0260752 -0.0427251 -0.0002976 -0.1060435 0.0500851 -0.0003482 -0.0005108 -0.0002336 0.1339379 0.0641626 -0.00617 0.0474503 0.0276467 0.0335105 0.0983877 -0.0027239 0.1091749 -0.0254863 unknown
polarizability: 186.6695121|23.0029846|132.5447934|0.1546146|0.2116913|47.1307424 unknown
InChI: InChI=1S/C8H7FINO/c1-5(12)11-8-3-6(9)2-7(10)4-8/h2-4,11H,1H3
charge 0 multiplicity 1
19 atoms
I  3.736033 2.204156 0.007377
F  1.554304 -2.841637 -0.005689
O  -2.933668 -1.043704 -0.004786
N  -1.605504 0.893965 0.000536
C  -0.294449 0.350872 0.000264
C  0.791121 1.273731 0.003152
C  -0.042967 -1.04589 -0.002737
C  2.112585 0.791227 0.002997
C  1.296492 -1.459197 -0.002713
C  2.402572 -0.5895 0.000062
C  -2.834638 0.21567 -0.001881
C  -4.044829 1.148802 -0.000647
H  0.596504 2.350935 0.00549
H  -0.863396 -1.764604 -0.004975
H  -1.658561 1.915547 0.002757
H  3.420581 -0.983793 -0.00009
H  -4.051749 1.794943 0.896774
H  -4.958344 0.538026 -0.003337
H  -4.049786 1.799949 -0.894454
