program: Gaussian 09
title: 000259280
version: EM64L-G09RevD.01
frameworkgroup: C1[X(C18H14O4)]
method: RPBEPBE
basis: SDD
operation: Freq
keyword: #pfreq=noraman
keyword: PBEPBE/SDD
title: #p freq=noraman PBEPBE/SDD
converged: YES YES NO NO
title: Mulliken charges:
elementType: O O O O C C C C C C C C C C C C C C C C C C H H H H H H H H H H H H H H
charge: -0.200760 -0.200757 -0.170194 -0.170194 -0.588915 -0.588913 0.527096 0.527084 -0.402688 -0.402516 -0.398965 -0.399126 -0.336764 -0.336810 -0.355048 -0.355002 0.315203 0.315197 0.031158 0.031159 -0.142226 -0.142225 0.232796 0.234600 0.232792 0.234600 0.240496 0.240491 0.240478 0.240483 0.291536 0.291536 0.276349 0.276351 0.205849 0.205848
chargesum: 0.00000
title: Mulliken charges with hydrogens summed into heavy atoms:
elementType: O O O O C C C C C C C C C C C C C C C C C C
charge: -0.200760 -0.200757 -0.170194 -0.170194 -0.121519 -0.121521 0.527096 0.527084 -0.162192 -0.162025 -0.158486 -0.158643 -0.045228 -0.045273 -0.078699 -0.078651 0.315203 0.315197 0.031158 0.031159 0.063623 0.063623
polarizability: 3.84792123e+02 -4.90015253e-03 2.01461339e+02 -2.26689729e+01 -4.51183387e-03 9.21420693e+01
1716.lowfreq: -3.9296 -1.5550 -0.0007 -0.0002 0.0003 6.3487 12.7322 18.1000 25.2732
frequency: 12.7316 18.0963 25.2611 30.0666 45.9418 48.6126 58.4897 93.6046 93.7434 121.2885 140.2610 161.1468 172.1682 245.7074 247.0459 277.7052 318.4809 326.3243 370.2622 377.9421 400.3674 400.5819 407.0384 476.1783 499.2312 507.0342 523.9452 594.6174 600.8370 619.5400 621.4964 641.2222 647.6792 659.5440 688.3629 750.3826 753.2200 788.8178 802.9977 822.3700 864.5578 865.4902 865.7148 878.9986 973.6687 976.0047 986.1918 988.9561 1001.4118 1002.9747 1003.3128 1003.6305 1006.7515 1007.2499 1029.2729 1029.6249 1099.6068 1127.5468 1149.0742 1196.9754 1197.1947 1219.5772 1221.9466 1261.8577 1264.8426 1271.0050 1271.5335 1313.5106 1316.5341 1318.2440 1346.7336 1346.7573 1380.6694 1381.6052 1416.2081 1416.8436 1475.6487 1488.5086 1497.5493 1498.1517 1537.6715 1539.4106 1571.1822 1571.5213 1614.3587 1617.5292 1624.7456 1624.8083 2919.4574 2919.6665 2992.5537 3001.2118 3043.2411 3068.9424 3125.3808 3125.7647 3129.1391 3129.4082 3158.1748 3158.2280 3178.0477 3178.0729
redmass: 7.3122 6.4252 6.3423 4.4985 5.1136 4.8396 6.5316 3.2007 3.1243 8.3349 5.8184 4.5262 6.5359 6.7668 6.3387 6.6940 4.6519 2.8258 3.1260 6.3807 2.8784 2.8805 5.1286 4.7034 7.3774 3.4633 5.6399 3.0226 2.6917 7.5377 7.3866 7.2368 7.4814 5.3034 3.8005 4.6055 3.7498 1.1896 5.5270 2.2053 1.4767 1.2467 1.2715 2.4223 1.9240 1.7999 3.4938 1.7295 1.4411 1.5282 1.3902 1.3807 4.4829 3.9241 3.4183 3.5007 1.3810 1.3225 1.1302 1.1293 1.1316 2.5407 2.3654 1.2248 1.5009 4.0096 4.1731 1.3569 1.3238 1.2962 1.2442 1.2444 4.4116 4.8029 3.5041 3.4349 1.1221 1.1024 2.4686 2.5873 7.5746 7.6005 7.2681 7.3806 6.4730 6.4051 9.1620 9.1358 1.0882 1.0882 1.0589 1.0595 1.1018 1.1051 1.0892 1.0892 1.0905 1.0905 1.0953 1.0953 1.0950 1.0950
irintensity: 0.0031 0.9842 1.1139 0.0047 0.0053 2.9087 0.0047 0.2082 38.8315 0.1466 0.5165 0.1021 0.5231 1.9706 18.2060 3.4703 0.5667 6.4486 0.7685 4.0942 0.0053 0.0047 0.3155 1.6359 64.1872 19.1218 6.2091 0.2327 48.0636 45.8510 3.5061 14.7385 2.3953 144.3701 3.2015 0.6632 0.5909 0.6554 7.6054 0.1243 108.2353 0.0036 7.3857 0.0201 0.0038 6.0282 0.0003 3.6567 1.1850 0.0033 0.0215 0.0715 0.0292 1.0036 0.0775 45.5267 6.8662 0.7413 9.6651 56.5637 0.2344 0.1014 0.0059 1.7350 41.4017 140.3467 0.4209 0.1468 1.5939 4.2734 0.0229 0.0236 24.9160 0.0145 31.4396 16.5341 0.0007 12.1961 1.6468 27.4023 501.3122 24.4848 124.4179 38.1654 235.4028 10.6266 3.4148 110.3151 267.0369 1.3852 0.0183 45.4114 0.0154 20.3243 3.7177 20.5279 18.2766 6.4356 4.3338 5.4465 15.9447 0.7470
temp: 298.150 k
press: 1.00000 atm
elementType: 8 8 8 8 6 6 6 6 6 6 6 6 6 6 6 6 6 6 6 6 6 6 1 1 1 1 1 1 1 1 1 1 1 1 1 1
symmnumber: 1
zpe: 706878.1 jmol-1
zpe.correction: 0.269236 hartree
zpe.thermalcorrener: 0.289488 hartree
zpe.thermalcorrenthalpy: 0.290432 hartree
zpe.thermalcorrgfe: 0.214846 hartree
zpe.sumelectzpe: -993.631910 hartree
zpe.sumelectthermal: -993.611657 hartree
zpe.sumelectthermalent: -993.610713 hartree
zpe.sumelectthermalfe: -993.686300 hartree
dipole: 0.0000 -0.3762 0.0003
dipole: 0.3762
quadrupole: -170.8338 -132.7588 -128.4313
quadrupole: 0.0007 1.3153 -0.0007
quadrupole: -26.8258 11.2492 15.5767 0.0007 1.3153 -0.0007
hfenergy: -993.9011457 hartree
pointgroup: C01 [X(C18H14O4)]
dipole: -0.0000041 -0.1479979 -0.0004519 debye
polarizability: 386.0458843|0.0243762|201.4607796|-12.0580535|0.248745|90.8888678 unknown
InChI: InChI=1S/C18H14O4/c19-11-17(21)15-7-3-13(4-8-15)1-2-14-5-9-16(10-6-14)18(22)12-20/h3-12H,1-2H2
charge 0 multiplicity 1
36 atoms
O  -6.806406 -1.304051 -0.05483
O  6.80875 -1.304341 0.057478
O  -6.719514 2.247096 -0.039074
O  6.721158 2.246823 0.057742
C  -0.34368 -0.146892 -0.70091
C  0.345771 -0.151345 0.70852
C  -1.856955 -0.142356 -0.584289
C  1.859047 -0.146019 0.591932
C  -2.575874 1.07918 -0.506015
C  2.577737 1.076009 0.519286
C  -2.585176 -1.362477 -0.506609
C  2.587495 -1.365624 0.508635
C  -3.97598 1.096976 -0.353546
C  3.97783 1.09477 0.36688
C  -3.980656 -1.359417 -0.35539
C  3.982986 -1.361605 0.357484
C  -4.698306 -0.129627 -0.275301
C  4.700395 -0.131323 0.283044
C  -6.172873 -0.201838 -0.11934
C  6.174992 -0.202553 0.126869
C  -7.075078 1.046331 -0.019236
C  7.076934 1.046227 0.03232
H  -0.000584 -1.036595 -1.261437
H  0.004163 0.743303 -1.257334
H  0.002707 -1.044577 1.263408
H  -0.002104 0.735311 1.270565
H  -2.029941 2.028047 -0.572789
H  2.031646 2.024467 0.590445
H  -2.046583 -2.315512 -0.574067
H  2.049057 -2.31905 0.571658
H  -4.514071 2.046541 -0.297406
H  4.515738 2.044683 0.315012
H  -4.548362 -2.294443 -0.299679
H  4.550873 -2.296255 0.297517
H  -8.146226 0.743274 0.082871
H  8.148192 0.743863 -0.070717
