program: Gaussian 09
title: 000259272
version: EM64L-G09RevD.01
frameworkgroup: C1[X(C12H9F2N3)]
method: RPBEPBE
basis: SDD
operation: Freq
keyword: #p
keyword: freq=noraman
keyword: PBEPBE/SDD
title: #p freq=noraman PBEPBE/SDD
converged: YES YES NO NO
title: Mulliken charges:
elementType: F F N N N C C C C C C C C C C C C H H H H H H H H H
charge: -0.170955 -0.179391 -0.056314 -0.689453 -0.095263 -0.217725 0.635275 0.404062 0.314499 -0.594266 -0.601639 0.163451 -0.340711 -0.294507 -0.205065 -0.203284 -0.238495 0.251621 0.254464 0.255259 0.281424 0.228873 0.226670 0.228163 0.321712 0.321594
chargesum: 0.00000
title: Mulliken charges with hydrogens summed into heavy atoms:
elementType: F F N N N C C C C C C C C C C C C
charge: -0.170955 -0.179391 -0.056314 -0.046147 -0.095263 -0.217725 0.635275 0.404062 0.314499 -0.342645 -0.347175 0.163451 -0.085452 -0.013083 0.023807 0.023386 -0.010331
polarizability: 3.98824042e+02 1.08992555e+00 1.49835863e+02 5.66520471e-03 1.75347028e-01 5.88782671e+01
1716.lowfreq: -5.6025 -2.5868 -0.0009 -0.0008 0.0007 5.3984 21.7487 39.3482 60.3635
frequency: 21.6034 39.3395 60.3153 88.1799 177.0452 181.4526 195.9769 228.8531 229.5043 252.0147 300.5449 329.3255 380.2801 406.4953 408.0996 435.5349 454.1945 474.0864 493.2668 522.3892 554.9114 579.7738 601.4763 609.3682 642.1936 644.1635 692.9525 744.6232 784.9309 799.8899 824.5662 855.2444 860.0590 869.5332 943.5386 984.7538 988.8967 989.3199 990.4267 1002.3036 1014.0968 1057.6710 1074.7953 1136.9988 1153.2845 1168.9917 1179.1495 1212.4052 1235.4146 1306.1931 1347.1511 1358.1462 1377.9571 1389.5540 1442.0800 1462.3744 1473.9703 1490.0060 1555.7588 1581.5860 1601.1020 1644.9238 1653.5719 3125.8300 3137.7330 3151.9138 3162.3512 3164.5210 3170.5564 3171.2124 3563.2772 3702.8962
redmass: 4.5508 6.5036 6.3011 6.5625 12.2918 7.0407 6.2042 4.5569 7.7475 5.4328 4.1808 11.1276 5.4825 1.0758 2.6780 7.3891 1.2508 8.7094 6.3908 3.4486 10.1109 4.2073 5.8130 6.6005 2.9007 5.7386 1.8853 2.6081 1.8474 6.3546 1.4517 1.2452 2.5923 7.4737 1.4412 6.0906 1.3649 4.1814 4.3696 1.3228 2.0928 1.4912 1.4975 2.9162 2.1081 1.0599 1.5194 1.6063 3.2148 1.3891 7.8943 5.7355 6.1135 8.8495 2.3686 2.2728 4.8539 5.3281 7.6908 6.1759 6.2649 1.6650 2.5476 1.0850 1.0889 1.0930 1.0923 1.0955 1.1000 1.0931 1.0454 1.1042
irintensity: 0.1031 5.7804 4.0263 0.0035 0.1358 1.1935 2.1408 0.0211 0.1666 0.2171 0.7165 1.7944 4.5209 0.1545 0.0003 15.6170 301.1790 21.5853 2.0013 11.8194 4.1801 0.0309 10.0928 2.4777 5.5067 3.7316 54.8602 0.0057 70.2448 1.3617 0.0046 0.0005 90.2655 2.2998 7.3846 8.0324 0.0133 20.4488 41.9503 0.9867 9.8811 26.9858 9.9996 4.7968 60.8698 0.2195 1.1941 13.2482 10.8662 1.4405 212.3035 55.6866 29.4552 6.0644 11.2081 4.2567 19.4331 12.7283 102.2609 2.0907 1.1209 49.4437 969.7572 1.8209 13.5516 25.3970 4.1202 15.4857 39.4421 2.8521 220.8482 29.4136
temp: 298.150 k
press: 1.00000 atm
elementType: 9 9 7 7 7 6 6 6 6 6 6 6 6 6 6 6 6 1 1 1 1 1 1 1 1 1
symmnumber: 1
zpe: 489924.0 jmol-1
zpe.correction: 0.186602 hartree
zpe.thermalcorrener: 0.201086 hartree
zpe.thermalcorrenthalpy: 0.202030 hartree
zpe.thermalcorrgfe: 0.143810 hartree
zpe.sumelectzpe: -825.381210 hartree
zpe.sumelectthermal: -825.366726 hartree
zpe.sumelectthermalent: -825.365782 hartree
zpe.sumelectthermalfe: -825.424002 hartree
dipole: 5.2671 -0.2645 -0.0021
dipole: 5.2738
quadrupole: -42.8117 -94.8530 -101.9571
quadrupole: -2.4426 -0.0186 0.0417
quadrupole: 37.0622 -14.9790 -22.0832 -2.4426 -0.0186 0.0417
hfenergy: -825.567812 hartree
pointgroup: C01 [X(C12H9F2N3)]
dipole: 2.072328 0.0118034 0.1017251 debye
dipolederiv: -0.2195637 0.0264392 0.2487046 0.0027944 -0.1310419 -0.0639484 0.0235102 -0.0638166 -0.7303878 -0.2029215 -0.0241729 -0.2329012 0.001685 -0.1375297 -0.0749964 0.0165333 -0.0746054 -0.8520273 0.8884854 0.0012777 -0.0114339 0.0184487 -0.0573315 -0.005926 0.2546476 -0.0053434 -0.1111312 -2.2995248 -0.0111382 -0.0944794 -0.0173976 -0.7111849 0.0593992 -0.1614599 0.0593305 -0.1468325 0.1882061 0.0042021 0.0423513 0.0620187 -0.1170588 0.0045445 0.5758762 0.004502 -0.0798781 -1.100014 0.0014289 0.0345137 -0.0406172 -0.0927214 -0.0324374 -0.4344498 -0.0329388 -0.3973058 2.3179644 0.0110664 0.0952434 0.0101863 0.1899628 0.0138651 0.0966864 0.013808 0.3217454 0.9770121 -0.0144115 -0.1396406 0.0513812 0.1842383 0.0774001 0.5250704 0.078102 0.9060508 1.125232 0.0108279 0.0959805 -0.0406455 0.1488335 0.0934586 -0.4321707 0.0920293 1.0364877 -1.0331259 0.0065991 0.0677666 0.0532143 -0.2611874 0.0146734 0.5160978 0.0153184 -0.1189945 -0.8861473 -0.0133604 -0.1225501 -0.0672742 -0.2701344 0.0075888 -0.6414636 0.0071734 -0.1967766 -0.0170585 -0.0017236 -0.0168007 -0.022797 0.0213598 0.0002125 -0.2206791 0.0002395 0.024975 -0.0426216 0.0113511 0.1179363 -0.0137699 -0.1385715 0.0179734 -0.1464102 0.0175895 0.047083 -0.0527046 -0.0080232 -0.0874171 0.0139518 -0.111032 0.0042708 0.1419326 0.0043762 -0.06604 0.0417989 -0.0150484 -0.1624522 -0.025028 -0.1593342 0.015812 -0.2666725 0.0157438 0.0087705 -0.2718965 0.0106619 0.1134102 0.0246161 -0.1527689 0.0276815 0.2652301 0.0278471 0.1350348 0.0125864 0.0028091 0.0255209 -0.0110249 -0.1522527 0.0146301 -0.1209903 0.0144924 0.0002519 -0.0024614 -0.0071592 -0.0671784 -0.0065615 0.1924428 -0.0218274 -0.0656422 -0.0217072 -0.0131021 -0.0045297 0.007242 0.0704275 0.006365 0.1980916 -0.0199217 0.0638487 -0.0198158 0.0090094 0.1082906 -0.0071064 -0.0734751 -0.0041421 0.1584466 -0.0185401 -0.0435764 -0.018431 -0.0338497 0.1032594 0.0079086 0.0850482 0.0058036 0.1565962 -0.0118223 0.0598084 -0.0117342 0.0327855 -0.0484141 0.0092805 0.1014067 0.013112 0.1576455 -0.0182722 0.1420392 -0.0182141 -0.0351272 0.0087566 -0.0066986 -0.0688805 -0.011982 0.1513983 -0.0240164 -0.1239449 -0.0240989 -0.0991117 -0.1543153 -0.0040531 -0.0370673 -0.0049497 0.1612356 -0.0072971 -0.0470585 -0.0072952 0.0857976 0.2918757 -0.0006917 -0.0074202 -0.0120358 0.3863262 -0.0267925 -0.1186818 -0.0269093 0.1318475 0.2718312 0.0024927 0.0233867 0.0146482 0.3855723 -0.0257119 0.141919 -0.0256422 0.1407258 unknown
polarizability: 398.8217086|0.2529441|59.7676227|-1.320607|8.9496601|148.9488401 unknown
InChI: InChI=1S/C12H9F2N3/c13-10-6-8(15)7-11(14)12(10)17-16-9-4-2-1-3-5-9/h1-7H,15H2
charge 0 multiplicity 1
26 atoms
F  1.149851 0.243467 2.356837
F  1.504705 -0.258481 -2.476154
N  -0.189629 -0.040551 -0.370724
N  5.469817 0.025163 0.253243
N  -1.010639 0.056523 0.651468
C  1.188722 -0.011006 -0.081731
C  4.087932 0.013392 0.141576
C  1.876217 0.119194 1.170558
C  2.070682 -0.12642 -1.204181
C  3.266664 0.133527 1.300309
C  3.463515 -0.118628 -1.132281
C  -2.394988 0.01898 0.272094
C  -3.311568 0.11993 1.352214
C  -2.878121 -0.108323 -1.062397
C  -4.700512 0.094341 1.106706
C  -4.265207 -0.132873 -1.297573
C  -5.181097 -0.032048 -0.218086
H  3.70299 0.237848 2.298425
H  4.048457 -0.213896 -2.051446
H  -2.90577 0.216546 2.364716
H  -2.152857 -0.18464 -1.878415
H  -5.405255 0.172282 1.941756
H  -4.642794 -0.23049 -2.321904
H  -6.259585 -0.052365 -0.411695
H  6.060888 -0.060657 -0.568817
H  5.919381 0.119588 1.159601
