program: Gaussian 09
title: 000259263
version: EM64L-G09RevD.01
frameworkgroup: C1[X(C10H15Cl2NO)]
method: RPBEPBE
basis: SDD
operation: Freq
keyword: #p
keyword: freq=noraman
keyword: PBEPBE/SDD
title: #p freq=noraman PBEPBE/SDD
converged: NO YES NO NO
title: Mulliken charges:
elementType: Cl Cl O N C C C C C C C C C C H H H H H H H H H H H H H H H
charge: 0.069246 0.013385 -0.235267 -0.105757 -0.055818 -0.059428 -0.447120 -0.428171 -0.469809 -0.468038 -0.448843 -0.433097 0.382568 -0.735668 0.205491 0.217835 0.215160 0.204935 0.211130 0.210869 0.210190 0.212170 0.215055 0.247295 0.231620 0.222049 0.211445 0.272415 0.334156
chargesum: 0.00000
title: Mulliken charges with hydrogens summed into heavy atoms:
elementType: Cl Cl O N C C C C C C C C C C
charge: 0.069246 0.013385 -0.235267 -0.105757 0.149673 0.158408 -0.027025 -0.006171 -0.047450 -0.005688 0.004826 0.050763 0.382568 -0.401512
polarizability: 1.58065863e+02 7.81622068e+00 1.22109796e+02 -4.27187898e+00 -1.64461919e-01 1.06484909e+02
1716.lowfreq: -20.5511 -0.0029 -0.0013 0.0021 0.9386 8.7069 40.6163 49.7060 63.2526
frequency: 39.8140 49.6457 63.2136 98.0138 149.5035 190.2110 204.2707 231.7065 249.4406 274.3664 321.0424 328.2304 361.2543 391.2157 413.2900 463.9001 508.5924 549.5345 578.0440 680.0680 735.2374 742.7333 747.0791 755.3080 788.0119 798.4994 827.5316 859.9844 885.2072 912.7653 934.7354 960.1620 965.0384 984.6997 1018.3609 1079.3500 1088.3613 1104.3540 1112.1629 1155.2698 1160.8092 1175.8761 1196.7577 1206.6995 1224.1404 1238.3084 1244.1229 1261.5164 1277.7085 1303.5445 1321.2933 1325.1198 1328.7211 1337.2048 1342.3112 1357.7979 1364.1951 1370.7882 1410.4034 1459.2214 1461.5859 1469.7958 1473.0456 1480.4148 1493.5305 1596.3604 2953.6099 2969.0438 2976.7357 2979.1640 2981.8720 2992.0998 2994.9002 3010.1116 3024.2980 3037.2224 3046.8564 3062.3976 3078.7712 3087.5767 3127.5256
redmass: 5.6134 9.0722 5.8191 3.0606 3.3982 4.8988 10.2720 2.3394 2.8625 4.9434 5.0562 3.7984 2.2006 2.2991 2.5834 5.6228 3.2253 7.3046 8.5086 4.3458 6.6284 2.4319 3.2638 3.0098 2.9129 2.3035 2.3180 2.5533 1.8786 2.7004 2.4190 2.3024 2.2032 2.1729 2.6582 1.6406 2.0135 1.8299 1.7642 1.1948 1.1621 2.3121 1.3381 1.2214 1.2053 1.2771 1.1673 1.6278 1.4481 1.6994 1.4131 1.6131 1.4301 1.3423 1.5024 1.3894 1.3651 1.3154 1.8888 1.0910 1.0848 1.0750 1.0811 1.0837 1.0884 8.7427 1.0694 1.0677 1.0692 1.0670 1.0660 1.0696 1.0729 1.0751 1.0983 1.1007 1.1029 1.1028 1.0922 1.0942 1.0884
irintensity: 0.8979 0.9378 0.7134 0.4577 0.5117 2.2930 0.2884 0.9133 1.1076 0.5921 1.3419 3.3303 1.1380 3.2746 1.2095 1.3237 1.2942 40.3997 35.8729 24.1602 22.1607 2.6037 7.8810 62.2479 20.3703 0.4334 11.8848 0.3088 4.5161 24.2443 1.7395 0.7354 2.5555 7.5564 6.1954 2.8359 3.1697 3.2492 6.7659 17.2319 32.4324 10.4128 18.7317 17.8395 2.6426 19.0509 1.6496 32.3236 4.4803 6.3073 1.6001 3.3356 0.5340 0.9462 16.0414 1.9660 5.4852 0.6375 28.1400 29.6454 9.9620 8.7700 11.4523 22.1088 6.0483 224.9544 35.1859 0.2465 32.5380 41.2985 10.1893 97.9017 94.1663 42.1447 25.0462 5.3056 54.1673 63.3503 18.6806 5.5387 5.7854
temp: 298.150 k
press: 1.00000 atm
elementType: 17 17 8 7 6 6 6 6 6 6 6 6 6 6 1 1 1 1 1 1 1 1 1 1 1 1 1 1 1
symmnumber: 1
zpe: 626865.1 jmol-1
zpe.correction: 0.238760 hartree
zpe.thermalcorrener: 0.252140 hartree
zpe.thermalcorrenthalpy: 0.253084 hartree
zpe.thermalcorrgfe: 0.197640 hartree
zpe.sumelectzpe: -1439.057015 hartree
zpe.sumelectthermal: -1439.043635 hartree
zpe.sumelectthermalent: -1439.042691 hartree
zpe.sumelectthermalfe: -1439.098135 hartree
dipole: 4.7543 1.6954 -2.9911
dipole: 5.8673
quadrupole: -101.5861 -101.2747 -96.0726
quadrupole: -3.6390 4.3440 1.4614
quadrupole: -1.9416 -1.6302 3.5719 -3.6390 4.3440 1.4614
hfenergy: -1439.2957749 hartree
pointgroup: C01 [X(C10H15Cl2N1O1)]
dipole: 1.8596729 0.7621303 -1.1354755 debye
polarizability: 158.5444174|6.1947254|120.5874964|-5.5685065|2.6962889|107.5286541 unknown
InChI: InChI=1S/C10H15Cl2NO/c11-9(12)10(14)13-5-7-1-2-8(6-13)4-3-7/h7-9H,1-6H2
charge 0 multiplicity 1
29 atoms
Cl -4.312163 -0.125375 -0.162861
Cl -2.374851 1.853497 1.137717
O  -1.894759 -1.659183 0.662057
N  -0.300536 -0.407743 -0.502694
C  1.564398 1.332941 -0.567689
C  1.909537 -1.192785 0.509689
C  2.780401 0.552023 -1.151081
C  1.609369 1.327452 0.983793
C  3.126433 -0.719977 -0.322372
C  1.566974 -0.119807 1.579023
C  0.187976 0.84897 -1.118963
C  0.674814 -1.521741 -0.390967
C  -1.56433 -0.609208 0.03775
C  -2.591056 0.526047 -0.196094
H  1.645983 2.382811 -0.917492
H  2.181065 -2.133062 1.028676
H  3.658917 1.224419 -1.178171
H  2.568027 0.282585 -2.204584
H  0.774794 1.929371 1.389419
H  2.543819 1.834365 1.293671
H  3.474763 -1.530611 -0.990772
H  3.961231 -0.505909 0.373045
H  2.29691 -0.198886 2.406702
H  0.574008 -0.332954 2.014102
H  -0.54199 1.651423 -0.928049
H  0.269986 0.712655 -2.218216
H  1.011076 -1.794273 -1.412062
H  0.116545 -2.373775 0.027615
H  -2.485142 1.056531 -1.149492
