program: Gaussian 09
title: 000259277
version: EM64L-G09RevD.01
frameworkgroup: C1[X(C17H12)]
method: RPBEPBE
basis: SDD
operation: Freq
keyword: #p
keyword: freq=noraman
keyword: PBEPBE/SDD
title: #p freq=noraman PBEPBE/SDD
converged: YES YES NO NO
title: Mulliken charges:
elementType: C C C C C C C C C C C C C C C C C H H H H H H H H H H H H
charge: 0.443093 -0.597510 -0.392405 -0.378675 -0.229752 -0.234518 -0.240424 0.326023 -0.396985 -0.397339 -0.221907 -0.221903 -0.241872 0.066247 -0.048767 -0.084553 -0.015937 0.255428 0.257637 0.249228 0.229042 0.226858 0.226694 0.228830 0.249953 0.250027 0.230763 0.230802 0.231921
chargesum: 0.00000
title: Mulliken charges with hydrogens summed into heavy atoms:
elementType: C C C C C C C C C C C C C C C C C
charge: 0.443093 -0.084444 -0.143177 -0.149633 -0.002894 -0.007823 -0.011594 0.326023 -0.147032 -0.147312 0.008856 0.008899 -0.009951 0.066247 -0.048767 -0.084553 -0.015937
polarizability: 3.97187744e+02 2.98991860e+01 1.54810179e+02 1.22988657e+01 -6.57168429e+00 8.91595436e+01
1716.lowfreq: -7.7952 -3.2833 -0.0008 -0.0005 -0.0005 2.6323 10.0736 15.0570 24.0213
frequency: 7.4321 13.8558 23.8332 48.5195 71.1848 141.2938 176.0409 188.2195 233.0740 272.8427 308.6845 363.7616 400.8102 403.2156 421.3204 456.5619 466.0745 486.3021 522.1926 544.5646 581.4786 615.9759 617.3580 667.4500 695.2657 701.7876 733.0833 772.4363 778.6714 844.7011 853.1455 854.9776 885.4922 928.2914 951.3722 978.9980 981.1015 984.8814 990.5866 997.7563 999.0240 1023.3160 1027.0395 1079.2575 1080.2955 1112.9210 1172.3257 1173.7168 1187.7838 1188.5571 1192.5733 1199.4394 1264.6019 1311.3963 1327.8245 1353.1814 1367.4489 1385.4384 1433.0921 1437.0454 1441.9366 1483.8354 1484.9096 1571.2242 1596.2689 1606.0194 1615.6385 2170.4786 2282.8144 2952.1628 2992.7905 3111.7349 3126.5036 3129.0280 3137.4396 3138.4574 3149.4209 3150.6094 3159.4599 3164.3469 3170.5234
redmass: 3.7538 4.0092 5.6856 4.5999 5.7878 4.6913 6.7819 2.7184 5.1691 5.0504 6.2865 5.8893 2.8349 2.8205 7.2889 3.3435 5.8862 6.6440 9.4315 4.4278 5.9041 6.4430 6.6180 6.4284 1.8493 2.3769 1.3290 1.7343 5.0073 5.0276 1.2472 1.2493 1.4703 1.4354 1.7465 1.3820 1.3829 6.2260 6.3074 1.3231 1.3233 2.3443 2.2365 1.6081 1.6418 3.5174 1.0525 1.0560 1.1644 1.1336 2.1122 1.0901 1.6308 1.4124 1.3715 3.5191 5.0671 7.6841 2.3924 1.3674 1.5837 2.3131 2.5443 5.6151 6.1953 6.0243 5.9944 11.9174 11.9208 1.0586 1.0981 1.0878 1.0860 1.0848 1.0881 1.0915 1.0955 1.0929 1.0970 1.1015 1.1017
irintensity: 0.0086 0.0171 0.4802 2.2081 0.7660 1.3358 0.5063 6.0869 0.4480 1.3937 1.6172 2.2375 0.0097 0.0249 3.7831 8.5855 1.2671 2.8179 0.7465 7.9875 2.7119 1.0646 0.0471 7.0737 44.5215 25.0293 79.7270 68.7603 0.8824 0.7248 0.0016 0.0121 2.6242 6.3934 10.7771 0.1249 0.0003 0.3241 0.5319 0.7287 0.2183 13.7087 10.5927 8.3081 5.7383 0.6961 0.0733 0.0015 1.8502 3.6508 10.2134 0.2948 24.5453 0.0775 1.2574 2.0654 0.0094 3.7912 7.6263 23.3085 16.5551 12.9387 42.9569 1.5891 1.1571 12.5405 24.8679 0.3361 6.3764 17.5476 5.6286 9.8940 0.3261 2.3380 3.5729 16.9785 36.5823 17.4954 29.2042 27.8908 24.9391
temp: 298.150 k
press: 1.00000 atm
elementType: 6 6 6 6 6 6 6 6 6 6 6 6 6 6 6 6 6 1 1 1 1 1 1 1 1 1 1 1 1
symmnumber: 1
zpe: 591651.9 jmol-1
zpe.correction: 0.225348 hartree
zpe.thermalcorrener: 0.240175 hartree
zpe.thermalcorrenthalpy: 0.241119 hartree
zpe.thermalcorrgfe: 0.178386 hartree
zpe.sumelectzpe: -653.767091 hartree
zpe.sumelectthermal: -653.752264 hartree
zpe.sumelectthermalent: -653.751320 hartree
zpe.sumelectthermalfe: -653.814053 hartree
dipole: 0.0218 -0.1323 -0.0163
dipole: 0.1350
quadrupole: -70.8240 -89.0785 -101.9832
quadrupole: 5.3177 2.4966 -2.0305
quadrupole: 16.4712 -1.7833 -14.6879 5.3177 2.4966 -2.0305
hfenergy: -653.9924389 hartree
pointgroup: C01 [X(C17H12)]
dipole: -0.0084449 0.0514604 -0.0101695 debye
polarizability: 396.034057|26.1639738|154.8207011|-27.5147749|0.3903134|90.3027082 unknown
InChI: InChI=1S/C17H12/c1-4-10-16(11-5-1)14-8-3-9-15-17-12-6-2-7-13-17/h1-2,4-7,10-13H,14H2
charge 0 multiplicity 1
29 atoms
C  3.873198 0.427229 -0.289511
C  2.862295 1.549184 -0.577649
C  3.477579 -0.847293 0.178428
C  5.251972 0.687704 -0.49529
C  4.445033 -1.84624 0.437969
C  6.218662 -0.307725 -0.236687
C  5.817392 -1.581275 0.232044
C  -3.687236 0.064641 0.133318
C  -4.550158 0.949566 0.848039
C  -4.237503 -1.12525 -0.43218
C  -5.919679 0.649632 0.989868
C  -5.608224 -1.416883 -0.284125
C  -6.455373 -0.532891 0.425978
C  1.447595 1.195887 -0.413158
C  -2.297411 0.366309 -0.014005
C  0.241598 0.926973 -0.284204
C  -1.087648 0.631429 -0.141889
H  3.020831 1.914314 -1.613913
H  3.091621 2.412771 0.081465
H  2.413832 -1.05544 0.337687
H  5.570744 1.673095 -0.859563
H  4.124998 -2.829777 0.800205
H  7.280548 -0.09222 -0.400563
H  6.565983 -2.355751 0.432956
H  -4.133002 1.863531 1.283575
H  -3.580117 -1.806809 -0.982053
H  -6.570926 1.337296 1.540537
H  -6.017767 -2.33351 -0.722664
H  -7.520537 -0.762796 0.538488
