program: Gaussian 09
title: 000259252
version: EM64L-G09RevD.01
frameworkgroup: C1[X(C8H9ClN2O)]
method: RPBEPBE
basis: SDD
operation: Freq
keyword: #p
keyword: freq=noraman
keyword: PBEPBE/SDD
title: #p freq=noraman PBEPBE/SDD
converged: NO NO NO NO
title: Mulliken charges:
elementType: Cl O N N C C C C C C C C H H H H H H H H H
charge: -0.087578 -0.268712 -0.425821 -0.704016 0.616277 -0.335175 -0.304618 0.556097 -0.466940 -0.443888 0.208440 -0.798380 0.311720 0.248095 0.222798 0.312418 0.237390 0.265443 0.237284 0.310710 0.308456
chargesum: 0.00000
title: Mulliken charges with hydrogens summed into heavy atoms:
elementType: Cl O N N C C C C C C C C
charge: -0.087578 -0.268712 -0.113403 -0.084850 0.616277 -0.335175 0.007102 0.556097 -0.218845 -0.221090 0.208440 -0.058263
polarizability: 1.81954121e+02 -6.24030691e+00 1.28659001e+02 -4.63382919e-02 2.37956848e-03 5.03190633e+01
1716.lowfreq: -91.5943 -9.5753 -5.3693 -3.0311 -0.0029 -0.0026 -0.0013 61.8397 70.0036
frequency: -91.5933 61.8304 70.0005 133.6108 158.6541 188.8539 211.8931 283.6073 319.9466 337.2408 349.7275 369.0628 394.3237 438.5435 451.6371 490.9727 571.5334 590.1036 627.6775 673.5489 677.8882 711.3689 799.4802 826.5561 838.5103 871.0649 935.0421 977.5309 986.2528 1015.1199 1029.4102 1032.6511 1149.2648 1226.9632 1232.5514 1300.4101 1327.0848 1370.6581 1375.8496 1434.6987 1448.5840 1467.6556 1487.9524 1522.7943 1571.7862 1624.6113 1639.3374 1652.9885 2989.1522 3074.3376 3135.3696 3135.8925 3160.6536 3183.6504 3489.3515 3573.5842 3713.2187
redmass: 1.0447 6.5670 3.6955 5.3452 4.4655 4.7070 8.8289 5.4268 4.2836 1.0795 1.3221 3.6135 6.6353 3.0336 4.1875 4.4592 3.4490 3.1132 4.9433 7.2335 1.1995 2.9617 4.5907 1.3670 1.7668 5.8695 6.4223 1.3171 1.8038 2.1298 1.6500 1.5060 1.2817 1.8316 2.0228 1.6213 3.6469 3.5486 1.3857 3.3376 1.2564 1.0468 2.2239 3.2867 5.1422 4.8402 1.3923 3.5402 1.0382 1.0984 1.0908 1.0979 1.0923 1.0945 1.0764 1.0450 1.1041
irintensity: 0.0433 9.6561 3.9535 8.9177 0.0045 4.6861 0.7131 3.0281 2.9166 35.8343 217.8780 77.3999 4.1404 6.2008 3.3206 16.3630 6.3897 5.2313 0.9132 8.1997 57.9778 16.3224 18.7501 3.8432 87.1435 34.4155 11.1861 4.0059 31.8871 21.5718 8.1933 1.7677 5.9684 1.5171 68.8390 80.5924 51.1735 83.8277 72.7575 37.7976 47.1826 19.2645 42.5312 536.4465 121.0448 164.9331 47.6872 186.8582 9.8868 15.9856 16.9385 9.1316 5.0359 9.7034 43.7820 94.9329 22.7075
temp: 298.150 k
press: 1.00000 atm
elementType: 17 8 7 7 6 6 6 6 6 6 6 6 1 1 1 1 1 1 1 1 1
symmnumber: 1
zpe: 416970.6 jmol-1
zpe.correction: 0.158816 hartree
zpe.thermalcorrener: 0.170143 hartree
zpe.thermalcorrenthalpy: 0.171088 hartree
zpe.thermalcorrgfe: 0.121219 hartree
zpe.sumelectzpe: -954.185397 hartree
zpe.sumelectthermal: -954.174070 hartree
zpe.sumelectthermalent: -954.173126 hartree
zpe.sumelectthermalfe: -954.222994 hartree
dipole: 3.0249 1.4880 0.0542
dipole: 3.3715
quadrupole: -53.3451 -80.4285 -81.6292
quadrupole: -13.4079 0.1523 -0.0535
quadrupole: 18.4558 -8.6276 -9.8283 -13.4079 0.1523 -0.0535
hfenergy: -954.3442131 hartree
pointgroup: C01 [X(C8H9Cl1N2O1)]
dipole: 1.2074111 0.5487282 0.0235672 debye
dipolederiv: -0.223907 0.1578739 0.0009195 0.1484391 -0.7312232 -0.0030946 0.0009581 -0.0037596 -0.0767193 -0.6848092 0.0403742 0.000372 -0.6626089 -0.9579522 -0.0052212 -0.0053096 -0.0048106 -0.3497321 -1.7017519 -0.2246513 -0.0012536 -0.4664433 -0.4706094 -0.0007078 -0.0042378 -0.001793 -0.2879819 -1.7107603 0.3246033 0.0097106 0.3645302 -0.1775379 0.0029646 0.0272153 -0.0004387 -0.7590496 0.731522 0.0216737 -0.0004393 -0.2601085 -0.4423009 -0.0029907 -0.0025772 -0.0023839 0.0444919 0.3752204 -0.0163951 -0.0011451 -0.2453651 1.0705349 0.0059666 -0.0017962 0.0064237 -0.0667845 0.0866251 -0.3105363 -0.0018788 0.0470386 0.1103529 0.0009685 0.0008882 0.0017988 -0.1200752 1.7199547 -0.3520486 -0.0081753 -0.4323834 0.0528617 0.0004697 -0.0101641 0.0001165 0.1492542 -0.4286109 -0.0723572 0.0001144 0.5708067 -0.2273779 -0.0015083 0.0025454 -0.0012137 -0.1872548 -0.467854 0.233837 0.0014541 -0.3271198 0.1445898 0.0019446 -0.0020382 0.0022483 -0.2351895 1.7748752 0.1729968 0.0017069 0.9869384 1.224703 0.0089898 0.0067938 0.0091205 0.1612258 -0.3802365 0.1326291 0.0010851 0.2693075 -0.1112967 -0.0016908 0.004243 -0.0017865 0.059018 0.1617333 -0.0408819 0.0000116 -0.0231375 0.069531 -0.0003106 -0.0000586 -0.0006276 0.1779921 -0.006561 -0.0711054 -0.0000143 -0.0742251 0.0217714 -0.0005989 0.0003381 -0.0002065 0.1800521 0.0256712 0.083184 0.0005553 0.0826346 -0.0924419 -0.0008646 0.0004948 -0.0014067 0.1682225 0.2158778 0.0192902 -0.0001672 0.1063117 0.1832078 -0.0012011 0.0006649 -0.0013646 0.2936491 0.0460584 -0.0003291 -0.0279336 0.0439015 0.0333824 -0.1058607 0.0291885 -0.1086227 -0.035641 -0.0127774 -0.0538807 -0.0007923 -0.1234304 0.0231713 -0.001312 -0.0016954 -0.0010984 0.1298904 0.0466988 -0.0012947 0.0283566 0.044209 0.0286848 0.1074926 -0.028294 0.1101684 -0.0311121 0.2029699 -0.0305342 -0.0009873 -0.0750116 0.135683 -0.0000325 -0.0068926 0.0027377 0.3927268 0.2300614 -0.0124477 -0.0014992 0.0257163 0.1122662 -0.0034026 -0.0102663 -0.0031015 0.393017 unknown
polarizability: 181.5236355|-7.8539004|129.0872041|-0.1535829|0.4165335|50.321346 unknown
InChI: InChI=1S/C8H9ClN2O/c1-5(12)11-8-3-2-6(10)4-7(8)9/h2-4,11H,10H2,1H3
charge 0 multiplicity 1
21 atoms
Cl 0.214519 2.88621 0.013463
O  -2.676773 -1.626285 -0.012472
N  -1.62727 0.475166 0.005209
N  3.929464 -0.795716 -0.011653
C  -0.254824 0.110174 0.001301
C  0.743178 1.117135 0.003996
C  0.210869 -1.235537 -0.004413
C  2.565576 -0.4972 -0.004587
C  2.118127 0.855156 0.001555
C  1.584088 -1.529374 -0.007011
C  -2.743373 -0.359984 -0.002761
C  -4.074341 0.391897 0.003408
H  -0.535519 -2.032664 -0.007121
H  2.832711 1.683397 0.003081
H  1.90263 -2.578186 -0.011826
H  -1.799293 1.485597 0.014752
H  -4.17613 1.02411 0.904691
H  -4.88974 -0.345272 -0.005552
H  -4.173571 1.043214 -0.884446
H  4.247872 -1.7596 -0.008387
H  4.628401 -0.059838 0.005072
