program: Gaussian 09
title: 000259271
version: EM64L-G09RevD.01
frameworkgroup: C1[X(C15H11ClN2O3)]
method: RPBEPBE
basis: SDD
operation: Freq
keyword: #p
keyword: freq=noraman
keyword: PBEPBE/SDD
title: #p freq=noraman PBEPBE/SDD
converged: YES YES NO NO
title: Mulliken charges:
elementType: Cl O O O N N C C C C C C C C C C C C C C C H H H H H H H H H H H
charge: -0.057367 -0.213938 -0.213907 -0.251584 -0.445840 0.015360 -0.690674 0.320339 0.317581 0.231349 0.185387 -0.566161 -0.422332 -0.583233 -0.354621 0.686701 -0.436781 0.411912 -0.390457 0.221759 -0.795290 0.260284 0.260279 0.329556 0.268930 0.299758 0.248916 0.287434 0.320766 0.242598 0.270741 0.242536
chargesum: 0.00000
title: Mulliken charges with hydrogens summed into heavy atoms:
elementType: Cl O O O N N C C C C C C C C C C C C C C C
charge: -0.057367 -0.213938 -0.213907 -0.251584 -0.125074 0.015360 -0.170111 0.320339 0.317581 0.231349 0.185387 -0.236605 -0.153402 -0.283475 -0.105705 0.686701 -0.436781 0.411912 -0.103023 0.221759 -0.039415
polarizability: 4.42318842e+02 2.64136817e-01 2.10781009e+02 -8.75739420e-03 1.25324713e-03 8.12715048e+01
1716.lowfreq: -86.2368 -7.0367 -6.5780 0.0006 0.0014 0.0019 1.2844 32.7118 49.0872
frequency: -86.2176 32.7080 49.0817 67.0255 69.5662 82.7448 107.1700 136.7298 148.4356 197.5119 199.8461 218.2082 250.8311 271.7747 286.5751 311.1304 375.4010 384.6353 404.9511 434.1211 443.6552 470.1305 511.5590 512.4464 546.3139 570.6576 577.8245 615.7181 627.6575 654.8842 675.8407 686.2449 703.6183 734.7570 744.1646 757.0584 765.7194 780.1069 850.7102 879.3622 895.2969 896.2302 924.5750 942.7502 949.2881 984.2190 989.8894 1003.0518 1009.0553 1032.7439 1071.3055 1121.4828 1140.9403 1146.3808 1178.8494 1200.4071 1206.8525 1218.0758 1233.3811 1245.3381 1277.2407 1319.2472 1355.9387 1360.6428 1379.1254 1401.2517 1425.3221 1438.3414 1439.1136 1444.3881 1454.7133 1466.2467 1489.5328 1504.0933 1582.6763 1590.1166 1617.9674 1623.7608 1637.1992 2992.0529 2992.5725 3037.7076 3077.3854 3140.2292 3147.9459 3166.5590 3174.2703 3177.2820 3185.6605 3477.8501
redmass: 1.0306 6.0146 11.3918 6.3987 5.8804 7.1504 5.3780 8.1803 5.9859 11.9127 3.5255 8.4690 3.4468 5.8505 3.6030 8.4317 6.6464 5.2527 7.7797 3.2003 3.0411 5.9587 3.6320 6.1827 4.7719 4.9986 3.1913 5.8497 4.0723 7.4098 7.0159 3.5070 1.5617 3.0536 7.8504 5.6771 3.1779 5.7240 1.4461 1.6049 4.4970 1.6361 4.7272 1.3740 3.0561 1.7655 1.4017 1.9259 6.1704 1.6695 1.9665 1.7597 1.1506 1.9598 2.4241 2.5944 2.7018 4.0376 2.1059 1.6159 1.4697 3.5368 5.7008 6.7485 1.2472 4.5913 1.2293 3.1141 2.3761 3.1572 1.7765 1.0463 4.6005 2.1184 6.3622 7.6741 7.3326 7.7393 5.0394 1.0385 1.0614 1.0992 1.0983 1.0981 1.0907 1.0932 1.0929 1.0937 1.0949 1.0764
irintensity: 0.1708 0.4159 0.0202 9.9568 2.5896 0.6118 0.2874 7.4611 1.9718 1.7971 1.0812 0.6952 0.9385 1.1024 6.8900 0.1314 9.9551 0.0030 3.3020 19.1770 0.0184 2.9635 0.1752 0.5242 1.3564 3.9619 0.4333 12.0940 0.6056 3.8932 14.6076 0.2514 81.9340 7.7530 32.5801 12.5867 5.0820 7.9842 45.4071 13.4958 6.1036 11.8695 2.1477 0.2691 37.3935 41.4912 0.7470 33.3369 22.5534 8.6489 61.5510 28.5779 0.0216 0.1512 6.5924 397.4339 53.1308 596.3112 14.3297 11.1415 49.9084 139.7296 6.8970 257.9352 75.1787 37.4278 12.5862 32.2219 5.9901 143.2386 21.1216 20.6432 15.6768 571.4742 101.2298 44.9964 194.2614 26.4638 91.8190 5.4275 4.9123 3.2392 11.9689 7.0513 6.7080 0.3511 1.5948 11.0266 1.5332 51.9027
temp: 298.150 k
press: 1.00000 atm
elementType: 17 8 8 8 7 7 6 6 6 6 6 6 6 6 6 6 6 6 6 6 6 1 1 1 1 1 1 1 1 1 1 1
symmnumber: 1
zpe: 603536.5 jmol-1
zpe.correction: 0.229875 hartree
zpe.thermalcorrener: 0.247089 hartree
zpe.thermalcorrenthalpy: 0.248033 hartree
zpe.thermalcorrgfe: 0.183514 hartree
zpe.sumelectzpe: -1371.931065 hartree
zpe.sumelectthermal: -1371.913851 hartree
zpe.sumelectthermalent: -1371.912907 hartree
zpe.sumelectthermalfe: -1371.977425 hartree
dipole: -7.4316 2.2308 0.0033
dipole: 7.7592
quadrupole: -154.5751 -129.1757 -129.0457
quadrupole: -1.1693 0.0196 -0.0031
quadrupole: -16.9763 8.4231 8.5532 -1.1693 0.0196 -0.0031
hfenergy: -1372.1609396 hartree
pointgroup: C01 [X(C15H11Cl1N2O3)]
dipole: -2.8873225 -0.9911399 -0.0029683 debye
polarizability: 441.9866296|8.7679219|211.1129613|0.0603673|0.1817885|81.2717656 unknown
InChI: InChI=1S/C15H11ClN2O3/c1-8(19)17-15-6-10-4-9-5-11(18(20)21)2-3-12(9)13(10)7-14(15)16/h2-3,5-7,17H,4H2,1H3
charge 0 multiplicity 1
32 atoms
Cl -3.560065 -2.979199 -0.004345
O  6.303291 -0.518979 0.000731
O  5.74657 1.694938 0.00403
O  -4.618094 2.256158 0.002654
N  -4.374099 -0.081744 -0.000529
N  5.43429 0.439202 0.000553
C  0.451355 1.648273 0.002035
C  -0.689924 0.640157 0.00063
C  1.688768 0.76058 0.00091
C  -0.163932 -0.687521 -0.001116
C  1.302027 -0.619333 -0.000953
C  -2.069417 0.881355 0.000879
C  -1.037803 -1.797728 -0.002649
C  3.04039 1.123706 0.001438
C  2.279152 -1.642412 -0.00228
C  -2.969151 -0.225865 -0.000649
C  -2.414632 -1.542829 -0.002379
C  4.000111 0.080937 0.000058
C  3.64179 -1.288875 -0.001766
C  -5.130016 1.100647 0.001076
C  -6.637037 0.858928 0.000542
H  0.417378 2.309396 0.889474
H  0.417469 2.311772 -0.883632
H  -2.490087 1.888986 0.00222
H  -0.669241 -2.826932 -0.004005
H  3.378209 2.163351 0.002837
H  1.989488 -2.698062 -0.003695
H  4.43377 -2.041896 -0.00275
H  -4.897954 -0.963803 -0.001789
H  -6.952242 0.29316 -0.89541
H  -7.147826 1.83185 0.00265
H  -6.952339 0.289182 0.893932
