program: Gaussian 09
title: 000259257
version: EM64L-G09RevD.01
frameworkgroup: C1[X(C13H6ClNO3)]
method: RPBEPBE
basis: SDD
operation: Freq
keyword: #p
keyword: freq=noraman
keyword: PBEPBE/SDD
title: #p freq=noraman PBEPBE/SDD
converged: NO YES NO NO
title: Mulliken charges:
elementType: Cl O O O N C C C C C C C C C C C C C H H H H H H
charge: 0.061697 -0.135370 -0.204739 -0.171989 0.014253 0.362341 0.270689 0.200782 0.227619 -0.291484 -0.554004 -0.412501 -0.378619 0.573968 -0.406128 -0.359684 -0.213774 -0.223640 0.307773 0.310370 0.256277 0.283992 0.239119 0.243052
chargesum: 0.00000
title: Mulliken charges with hydrogens summed into heavy atoms:
elementType: Cl O O O N C C C C C C C C C C C C C
charge: 0.061697 -0.135370 -0.204739 -0.171989 0.014253 0.362341 0.270689 0.200782 0.227619 -0.291484 -0.246231 -0.102131 -0.122342 0.573968 -0.122136 -0.359684 0.025345 0.019413
polarizability: 2.95665609e+02 1.38889218e+01 1.95682112e+02 2.56980606e-02 1.58536351e-02 5.97142907e+01
1716.lowfreq: -39.4258 -7.5398 -6.8375 -0.0017 -0.0011 -0.0003 3.1569 51.8914 71.5181
frequency: -39.4074 51.8839 71.5153 125.2859 137.9174 176.2746 207.4388 212.3679 240.2057 280.6280 315.8209 337.9657 342.8418 415.7255 438.0377 474.2049 503.6705 512.8398 551.8037 583.8196 618.9168 640.7101 662.5189 668.7105 722.0393 727.8834 744.3266 750.5484 783.4423 833.2158 849.0720 901.2561 925.6329 937.1999 948.0957 973.3233 1003.1357 1009.1614 1033.5717 1080.2885 1088.1648 1131.1642 1170.3732 1187.2441 1193.9409 1221.1561 1227.9508 1293.3722 1348.3612 1365.4457 1389.0911 1419.8602 1440.3248 1450.0684 1475.2212 1588.0803 1598.6129 1600.6790 1621.6436 1640.9794 3136.7802 3147.5971 3157.9466 3169.2193 3172.7289 3178.8010
redmass: 16.2259 11.4820 6.3442 7.4499 5.8775 5.4875 6.2777 20.9749 10.1787 12.4648 8.6626 6.0099 15.1834 3.7305 3.1539 4.8079 8.6277 7.3192 8.5850 5.3167 6.6889 7.3203 5.6016 7.5951 6.7518 6.1835 11.4269 1.7246 2.5291 2.7948 7.9023 1.4245 1.6135 8.8483 1.5287 1.4607 1.3647 3.4096 2.4277 2.4192 2.2706 3.6257 1.2685 8.9366 2.5002 3.1736 1.2735 1.6105 6.5384 9.9649 4.3661 5.0631 2.7511 2.8261 4.5619 9.9226 8.4776 6.9472 8.1250 10.7464 1.0867 1.0902 1.0951 1.0933 1.1004 1.0921
irintensity: 0.0003 2.6313 0.7188 2.0014 2.3657 1.4823 0.9676 0.0262 2.1875 0.4952 5.0293 0.1333 1.0923 2.2779 0.3720 12.3866 1.3755 9.7186 6.7220 4.6250 2.9233 0.7570 0.0095 16.4113 9.8186 1.5764 26.0589 58.6886 32.6175 1.2405 48.3055 3.3293 4.6777 3.7202 27.7988 5.4650 0.0152 10.6293 4.7585 15.4546 18.1788 56.0170 24.8254 293.2799 62.0363 0.2247 3.7536 20.2522 16.9367 21.2001 41.1983 169.5670 20.7909 10.0086 1.7410 17.2218 131.2920 7.3931 28.5573 87.9484 1.3645 3.4349 9.3561 2.3179 25.3572 6.3303
temp: 298.150 k
press: 1.00000 atm
elementType: 17 8 8 8 7 6 6 6 6 6 6 6 6 6 6 6 6 6 1 1 1 1 1 1
symmnumber: 1
zpe: 413956.4 jmol-1
zpe.correction: 0.157668 hartree
zpe.thermalcorrener: 0.170593 hartree
zpe.thermalcorrenthalpy: 0.171537 hartree
zpe.thermalcorrgfe: 0.117487 hartree
zpe.sumelectzpe: -1238.165460 hartree
zpe.sumelectthermal: -1238.152534 hartree
zpe.sumelectthermalent: -1238.151590 hartree
zpe.sumelectthermalfe: -1238.205640 hartree
dipole: -5.4371 -1.1151 0.0007
dipole: 5.5502
quadrupole: -108.9723 -115.7449 -109.8464
quadrupole: 18.4720 -0.0065 -0.0111
quadrupole: 2.5489 -4.2237 1.6748 18.4720 -0.0065 -0.0111
hfenergy: -1238.3231272 hartree
pointgroup: C01 [X(C13H6Cl1N1O3)]
dipole: 2.1010601 0.5947838 0.0002824 debye
dipolederiv: -0.5569622 -0.3533328 -0.0002512 -0.3814117 -0.2798286 -0.000075 -0.0004109 -0.0002176 0.0123949 -0.5712261 0.1305097 -0.00001 0.1136053 -0.9889003 0.0000209 -0.0000177 -0.0000981 -0.2874895 -0.540485 0.0773817 0.0003773 0.1274263 -0.8423612 0.0012737 0.0004278 0.0011914 -0.2261112 -0.8746614 0.0156347 0.0013544 0.0469469 -0.4049233 0.0007258 0.0008092 0.000714 -0.1964596 1.572831 -0.4084422 -0.0019913 -0.4424056 1.3288632 -0.0024004 -0.0015368 -0.0019145 0.1843904 0.3802833 0.0885194 -0.000045 0.2176379 -0.1732984 -0.0000412 -0.0002396 -0.0000024 0.0062181 0.1194837 0.1407552 0.0000337 0.1109482 0.1370805 0.0000078 0.000084 -0.0000037 -0.0099771 -0.543781 0.1349762 0.0000252 0.0325489 0.025818 0.0000275 0.0000449 0.0000549 0.0472499 -0.597823 -0.3169569 -0.0000051 -0.2663175 -0.4170297 -0.0000181 0.0000039 0.0000196 0.03418 1.3573974 0.045126 0.0000029 0.0270883 1.2604655 -0.0000081 0.0001346 0.000019 0.116725 -0.1220591 -0.1901157 0.0000561 0.0657003 -0.0370239 -0.0000165 -0.000426 0.000242 -0.1119544 -0.3759216 -0.1789512 -0.0001124 0.0870342 0.083134 -0.0000056 -0.0001027 0.0000017 -0.0509544 -0.2659551 -0.2791026 -0.0000243 -0.1484309 -0.0281061 0.0000249 0.0000119 0. -0.1315736 -0.5034893 0.2477232 0.0002412 0.3193243 -0.3586386 0.000321 0.0001545 -0.000033 0.1235703 0.1729234 0.039471 -0.0000114 -0.1655176 0.1140304 0.000019 -0.0000552 0.0000203 -0.1034117 0.9089474 0.6016034 0.0003877 0.1847921 0.4483101 0.0002786 0.0009453 0.0000834 -0.0906267 0.0875083 0.1575725 -0.0000115 0.1254718 0.1212284 0.0000013 -0.0000236 -0.0000026 -0.1177132 0.0814919 0.0352182 -0.0000264 -0.0087339 -0.1320711 0.000001 -0.0000174 -0.0000029 -0.1607225 0.1469581 -0.0261668 -0.0000332 -0.0555928 0.0651554 -0.0000683 0.0002367 -0.0000255 0.1648082 0.0994594 0.0075666 -0.000006 -0.0159591 0.042905 -0.0000219 -0.0000785 -0.0000269 0.161212 0.0431128 0.101314 0.0000142 0.0612762 -0.0072792 -0.0000196 0.0000059 -0.000008 0.1556874 0.0610832 0.0316252 0.000011 0.0871929 0.0108674 -0.0000153 0.0000126 -0.0000057 0.1598465 0.0338407 -0.0754112 0.0000021 -0.1000917 -0.0579961 -0.0000061 0.0000094 0.0000037 0.155651 -0.1129566 -0.0265177 0.0000222 -0.0225328 0.0895988 -0.0000053 0.0000279 -0.000009 0.1650601 unknown
polarizability: 293.0884137|21.0698165|198.2593074|-0.0244629|-0.0177001|59.7142907 unknown
InChI: InChI=1S/C13H6ClNO3/c14-11-5-10-9(6-12(11)15(17)18)7-3-1-2-4-8(7)13(10)16/h1-6H
charge 0 multiplicity 1
24 atoms
Cl -3.844347 -2.023878 -0.00057
O  1.829465 -2.932194 -0.00026
O  -3.224934 2.530738 -0.00296
O  -4.623643 0.738217 0.00307
N  -3.44805 1.255821 0.000381
C  0.181373 0.277912 0.000109
C  1.614353 0.671985 0.00007
C  0.104027 -1.146847 -0.000037
C  2.408621 -0.515436 -0.00008
C  1.50717 -1.714352 -0.000018
C  -0.993633 1.034229 0.000173
C  -1.119365 -1.818401 -0.00017
C  2.23042 1.934507 0.000098
C  -2.249388 0.362148 0.000174
C  3.812001 -0.462769 -0.000214
C  -2.318802 -1.058458 -0.000012
C  3.649786 1.991757 -0.000028
C  4.433695 0.811178 -0.000192
H  -1.005239 2.126777 0.00017
H  -1.158942 -2.911335 -0.000364
H  1.642236 2.858129 0.000187
H  4.399323 -1.386547 -0.000317
H  4.148593 2.966963 -0.000022
H  5.525779 0.888257 -0.000288
