program: Gaussian 09
title: 000259255
version: EM64L-G09RevD.01
frameworkgroup: C1[X(C13H12N2O)]
method: RPBEPBE
basis: SDD
operation: Freq
keyword: #p
keyword: freq=noraman
keyword: PBEPBE/SDD
title: #p freq=noraman PBEPBE/SDD
converged: YES YES NO NO
title: Mulliken charges:
elementType: O N N C C C C C C C C C C C C C H H H H H H H H H H H H
charge: -0.440471 -0.707230 -0.707236 -0.345809 0.229334 0.229246 0.198198 0.198118 -0.625101 -0.625072 -0.391093 -0.391071 0.541279 0.541297 -0.445248 -0.445260 0.243976 0.247784 0.247804 0.232511 0.232508 0.213223 0.213227 0.337343 0.302738 0.306134 0.302737 0.306133
chargesum: 0.00000
title: Mulliken charges with hydrogens summed into heavy atoms:
elementType: O N N C C C C C C C C C C C C C
charge: -0.103128 -0.098358 -0.098366 -0.101832 0.229334 0.229246 0.198198 0.198118 -0.377317 -0.377267 -0.158582 -0.158563 0.541279 0.541297 -0.232025 -0.232034
polarizability: 2.99312691e+02 6.56141875e-04 1.58194036e+02 -3.24303764e-03 -7.12465472e+00 7.20440642e+01
1716.lowfreq: -2.5145 -1.5835 0.0007 0.0007 0.0008 1.8153 54.5741 113.7453 117.1870
frequency: 54.5737 113.7453 117.1868 147.7783 154.6669 227.3615 252.2963 314.9130 322.2269 333.1882 334.9782 356.2125 357.5668 367.5272 371.5298 391.4586 408.1305 439.2451 468.5976 522.7131 547.5803 567.3051 587.1312 626.1620 656.7641 706.2183 725.1232 737.9075 775.0825 786.5672 814.3622 821.2686 872.6009 877.8407 901.7517 936.2586 937.4068 946.3146 967.1992 992.9264 1027.3950 1036.1861 1111.1353 1127.8002 1152.2095 1155.7437 1196.1461 1200.6457 1224.0496 1268.7524 1299.2188 1320.3300 1328.5987 1354.8546 1373.9405 1393.3671 1463.7254 1470.6585 1481.0216 1503.8222 1586.7917 1596.8585 1635.3624 1636.3440 1644.0720 1644.3123 3022.6627 3113.7769 3115.0557 3123.1076 3123.6682 3138.8202 3141.0249 3547.0805 3568.7015 3569.4155 3710.1075 3710.1284
redmass: 5.1512 4.8720 3.8195 4.3678 4.5255 3.9588 4.2842 5.1055 1.9504 1.3476 1.2583 1.2935 1.0508 2.2598 1.4314 4.9431 3.1637 2.9877 3.2786 6.1080 4.1679 4.8604 3.4552 4.6633 4.8947 3.7994 5.5227 4.4882 4.2082 3.7104 1.4448 1.6588 1.5289 1.8152 3.5404 1.4162 1.3531 2.4997 4.5224 5.0354 1.4833 1.4785 2.2673 1.9060 1.2881 1.6138 1.5363 1.2470 1.5607 1.5935 1.7526 2.2067 4.6335 1.1881 7.4541 3.3070 3.6880 6.1078 3.6902 4.6735 7.5675 6.8258 2.0204 1.5427 1.9857 2.8163 1.0835 1.0867 1.0871 1.0916 1.0917 1.0965 1.0964 1.0661 1.0446 1.0448 1.1040 1.1040
irintensity: 5.4043 0.4523 0.0468 0.1140 3.9485 0.2389 7.3003 1.5613 23.5337 0.1476 635.0316 0.2929 0.0459 0.6512 79.0136 0.0965 0.6544 0.4777 16.9531 17.1077 0.4150 6.0593 11.4790 4.8854 0.0380 1.7450 1.2382 13.3975 10.4057 53.0822 82.1852 0.0077 0.0687 47.8355 15.7030 0.0203 0.1009 0.0258 53.9193 1.3816 5.4685 0.0936 6.2063 29.6351 3.1447 35.5699 3.8605 26.4078 2.3718 36.4586 5.2229 121.2399 13.1403 31.2268 29.4087 1.2048 0.5966 0.8243 422.1937 0.2194 35.8405 10.1417 0.1221 35.9742 23.2920 596.1491 12.9332 41.3304 0.7922 22.2364 19.6818 16.2800 38.1105 6.6931 203.0311 4.4070 12.3506 26.5448
temp: 298.150 k
press: 1.00000 atm
elementType: 8 7 7 6 6 6 6 6 6 6 6 6 6 6 6 6 1 1 1 1 1 1 1 1 1 1 1 1
symmnumber: 1
zpe: 579929.0 jmol-1
zpe.correction: 0.220883 hartree
zpe.thermalcorrener: 0.234668 hartree
zpe.thermalcorrenthalpy: 0.235612 hartree
zpe.thermalcorrgfe: 0.181600 hartree
zpe.sumelectzpe: -686.210147 hartree
zpe.sumelectthermal: -686.196363 hartree
zpe.sumelectthermalent: -686.195419 hartree
zpe.sumelectthermalfe: -686.249430 hartree
dipole: -0.0001 -0.9039 0.4424
dipole: 1.0063
quadrupole: -49.9580 -90.1403 -97.6329
quadrupole: 0.0003 0.0021 -2.0149
quadrupole: 29.2857 -10.8965 -18.3891 0.0003 0.0021 -2.0149
hfenergy: -686.4310307 hartree
pointgroup: C01 [X(C13H12N2O1)]
dipole: -0.0006579 -0.3483246 0.1881928 debye
polarizability: 299.3043512|-0.6630335|157.4858385|-1.1370544|-10.5559126|72.7606016 unknown
InChI: InChI=1S/C13H12N2O/c14-7-1-3-9-10-4-2-8(15)6-12(10)13(16)11(9)5-7/h1-6,13,16H,14-15H2
charge 0 multiplicity 1
28 atoms
O  0.044259 2.774099 0.46939
N  4.917282 0.206561 -0.088014
N  -4.855356 0.248745 -0.04091
C  0.035127 1.590467 -0.419014
C  1.227064 0.645925 -0.235086
C  -1.163073 0.656164 -0.223817
C  0.765655 -0.689573 -0.029597
C  -0.711241 -0.683246 -0.022614
C  2.588583 0.963512 -0.258359
C  -2.521942 0.985532 -0.233866
C  1.711161 -1.722824 0.143122
C  -1.66396 -1.708297 0.159173
C  3.54815 -0.080535 -0.074287
C  -3.488679 -0.050171 -0.04047
C  3.090241 -1.418289 0.119701
C  -3.040521 -1.391854 0.149021
H  0.032368 2.050255 -1.424474
H  2.916367 1.999694 -0.406419
H  -2.842159 2.024519 -0.378782
H  1.391671 -2.759819 0.298172
H  -1.351973 -2.748024 0.311172
H  3.826869 -2.220184 0.255868
H  -3.782725 -2.187355 0.292184
H  0.047025 2.448185 1.406157
H  5.605024 -0.529576 0.038116
H  5.247841 1.156251 -0.228113
H  -5.548162 -0.481444 0.091916
H  -5.179095 1.201182 -0.178268
