program: Gaussian 09
title: 000259254
version: EM64L-G09RevD.01
frameworkgroup: C1[X(C13H12N2O)]
method: RPBEPBE
basis: SDD
operation: Freq
keyword: #p
keyword: freq=noraman
keyword: PBEPBE/SDD
title: #p freq=noraman PBEPBE/SDD
converged: YES YES NO NO
title: Mulliken charges:
elementType: O N N C C C C C C C C C C C C C H H H H H H H H H H H H
charge: -0.437575 -0.690179 -0.692703 -0.341549 0.237035 0.246045 0.205409 0.165777 -0.594508 -0.570065 -0.405412 -0.394139 0.270853 0.280633 -0.239003 -0.233712 0.243895 0.246338 0.228306 0.255470 0.234139 0.224411 0.222202 0.336376 0.301213 0.300675 0.302208 0.297859
chargesum: 0.00000
title: Mulliken charges with hydrogens summed into heavy atoms:
elementType: O N N C C C C C C C C C C C C C
charge: -0.101199 -0.088291 -0.092636 -0.097654 0.237035 0.246045 0.205409 0.165777 -0.348170 -0.341759 -0.149942 -0.160000 0.270853 0.280633 -0.014592 -0.011510
polarizability: 2.75852809e+02 6.04095775e+00 1.68973803e+02 1.05896005e+00 -5.69429572e+00 7.27693980e+01
1716.lowfreq: -6.4615 -4.6591 -0.0008 -0.0007 -0.0004 4.8952 67.2616 92.3340 117.6040
frequency: 67.2577 92.3327 117.6026 158.4476 173.3073 213.3701 240.2082 245.2693 296.8181 337.4642 353.4884 365.4578 385.0935 415.4760 430.5299 458.3335 483.0240 522.7636 527.9023 558.3172 569.6621 592.6416 612.5639 635.1073 669.8285 716.5826 724.5626 738.7327 757.5823 776.3285 800.6398 846.1964 860.1786 873.2435 878.6619 945.8287 947.2245 981.7037 982.3094 1021.9338 1049.5319 1069.5320 1093.9559 1135.9606 1165.6236 1176.3015 1192.8765 1199.8298 1222.4677 1229.0829 1283.9717 1286.7206 1349.0221 1354.4827 1387.8920 1417.3854 1445.6583 1450.7056 1483.1525 1507.2186 1592.5741 1600.8873 1610.4760 1617.6800 1641.4479 1644.5304 3020.1695 3118.8760 3120.3959 3126.2592 3131.0796 3142.5969 3160.1137 3498.5816 3502.9291 3545.5126 3641.7315 3647.6341
redmass: 4.7394 4.6305 4.4038 4.6908 4.2221 1.3316 3.9140 2.3684 3.4137 2.6865 4.0917 1.6202 4.0323 3.4030 2.9049 3.6681 1.1475 1.9457 3.5833 3.7272 3.4222 1.3843 2.9504 4.3205 5.5716 5.4190 4.3513 2.2330 2.7675 2.5275 2.9194 2.6449 1.6340 1.6483 1.5364 1.6143 4.2604 1.7095 2.5187 2.0297 1.5607 1.3783 2.0275 2.3946 1.2417 1.5321 1.7031 1.2518 2.0630 2.2567 1.8385 1.5210 3.5732 1.2145 6.3521 3.4338 4.0081 2.9779 4.5714 4.9195 7.0772 7.5881 1.7832 5.6529 2.5175 1.1252 1.0835 1.0897 1.0866 1.0916 1.0891 1.0948 1.1002 1.0463 1.0462 1.0661 1.0994 1.0999
irintensity: 2.7619 0.7969 0.0780 1.1593 0.2724 7.2973 1.1669 8.8425 4.1622 21.7531 6.7703 83.1986 8.4101 27.2236 14.4099 12.3358 13.5309 210.2917 39.0920 41.7789 42.3629 360.6375 25.3820 26.5267 21.5964 3.6714 6.4813 36.8839 44.8016 37.1427 14.4128 5.6901 23.9223 22.4412 1.5429 12.6279 47.7582 7.1553 13.7782 7.2892 3.7354 6.4594 3.1029 23.3600 6.2535 8.8091 4.4787 23.1224 4.2980 14.6058 4.8153 2.0372 120.4007 52.9873 12.2804 44.0008 148.4356 3.4811 76.9028 70.4773 7.0306 87.3792 13.7732 35.4169 109.9107 114.7731 15.5068 13.4765 9.0921 12.9956 5.2392 30.9440 39.4821 27.8176 29.8839 6.2217 34.1725 4.8592
temp: 298.150 k
press: 1.00000 atm
elementType: 8 7 7 6 6 6 6 6 6 6 6 6 6 6 6 6 1 1 1 1 1 1 1 1 1 1 1 1
symmnumber: 1
zpe: 581617.3 jmol-1
zpe.correction: 0.221526 hartree
zpe.thermalcorrener: 0.234946 hartree
zpe.thermalcorrenthalpy: 0.235890 hartree
zpe.thermalcorrgfe: 0.182518 hartree
zpe.sumelectzpe: -686.206232 hartree
zpe.sumelectthermal: -686.192813 hartree
zpe.sumelectthermalent: -686.191868 hartree
zpe.sumelectthermalfe: -686.245240 hartree
dipole: 3.6531 -2.1349 0.4449
dipole: 4.2545
quadrupole: -69.6535 -86.9693 -95.9207
quadrupole: 1.3155 -0.4204 -4.0734
quadrupole: 14.5277 -2.7882 -11.7395 1.3155 -0.4204 -4.0734
hfenergy: -686.4277583 hartree
pointgroup: C01 [X(C13H12N2O1)]
dipole: 1.4130784 0.8731618 -0.2064734 debye
polarizability: 276.1119838|-3.0067599|168.1359942|-0.46048|-9.3915836|73.3480325 unknown
InChI: InChI=1S/C13H12N2O/c14-11-5-9-7-3-1-2-4-8(7)13(16)10(9)6-12(11)15/h1-6,13,16H,14-15H2
charge 0 multiplicity 1
28 atoms
O  -0.805057 -2.883841 -0.554595
N  4.317855 -0.749623 0.183562
N  3.707311 1.901811 -0.235745
C  -0.700849 -1.740699 0.381122
C  0.574047 -0.911238 0.234176
C  0.254648 0.465883 0.067144
C  -1.799807 -0.684989 0.218653
C  -1.217314 0.609231 0.056304
C  1.910058 -1.338646 0.280728
C  1.280666 1.420764 -0.091218
C  -3.191415 -0.858013 0.221931
C  -2.043416 1.74375 -0.092907
C  2.952816 -0.386854 0.143288
C  2.633152 0.999479 -0.07349
C  -4.022803 0.282795 0.061201
C  -3.449987 1.569233 -0.089611
H  -0.761575 -2.239552 1.366166
H  2.150649 -2.39728 0.4364
H  1.047434 2.48025 -0.254553
H  -3.627111 -1.856656 0.337894
H  -1.613626 2.745141 -0.210958
H  -5.112652 0.169098 0.055997
H  -4.104107 2.441052 -0.206999
H  -0.747707 -2.524964 -1.477644
H  4.963555 -0.092966 0.626197
H  4.542744 -1.736649 0.299384
H  4.531755 1.562657 -0.734313
H  3.487232 2.888529 -0.360114
