program: Gaussian 09
title: 000259261
version: EM64L-G09RevD.01
frameworkgroup: C1[X(C10H15Cl2NO)]
method: RPBEPBE
basis: SDD
operation: Freq
keyword: #p
keyword: freq=noraman
keyword: PBEPBE/SDD
title: #p freq=noraman PBEPBE/SDD
converged: YES YES NO NO
title: Mulliken charges:
elementType: Cl Cl O N C C C C C C C C C C H H H H H H H H H H H H H H H
charge: -0.001419 0.026802 -0.240263 -0.303119 -0.186739 -0.118681 -0.005106 -0.511307 -0.510594 -0.483004 -0.454838 -0.506246 0.366208 -0.710409 0.231871 0.233079 0.251863 0.216532 0.225579 0.214920 0.219470 0.226408 0.213588 0.205080 0.227552 0.230408 0.262933 0.321241 0.358191
chargesum: 0.00000
title: Mulliken charges with hydrogens summed into heavy atoms:
elementType: Cl Cl O N C C C C C C C C C C
charge: -0.001419 0.026802 -0.240263 0.018122 0.045132 0.114399 0.246757 -0.069196 -0.076204 -0.043008 -0.022205 -0.012905 0.366208 -0.352218
polarizability: 1.45644223e+02 -7.48344442e-01 1.22711853e+02 -4.26261620e+00 1.99169389e+00 1.18982271e+02
1716.lowfreq: -19.9672 -11.6167 0.0014 0.0018 0.0023 8.7951 14.1935 29.4623 39.8556
frequency: 5.2514 28.4325 39.6176 41.0887 104.4267 149.7170 155.4522 214.1427 231.6315 251.1098 296.5887 356.1478 376.4259 402.8905 433.2130 477.5275 570.0526 573.2392 606.5807 660.4177 682.1440 729.4322 749.9721 759.3698 791.5723 808.4083 838.8258 862.8397 880.9456 912.9576 925.0003 933.7857 952.8619 961.9188 984.4138 1016.5851 1037.6191 1055.7849 1073.6441 1103.2406 1109.2503 1136.6157 1150.1751 1167.5127 1186.2055 1198.8069 1206.5208 1211.5677 1237.8637 1251.2697 1265.0159 1269.1464 1274.1603 1286.1927 1292.5852 1310.2088 1313.6650 1350.3938 1354.3686 1451.4209 1464.4050 1470.4946 1474.3844 1493.3670 1503.7791 1626.2232 2982.1175 2994.0725 2999.7632 3004.2316 3008.3830 3015.6820 3044.9770 3049.5725 3057.2265 3064.2858 3065.9359 3071.0818 3076.1497 3164.8487 3537.3960
redmass: 6.0549 5.1658 10.1107 4.4921 3.4460 6.6871 6.0832 3.5422 4.8615 5.1469 2.2356 3.1930 6.6221 2.5772 2.0712 2.4367 3.1419 1.4906 4.5610 4.3898 5.5655 3.3472 7.2996 3.9844 2.0835 1.7765 2.3744 2.0480 2.6493 2.2053 2.9434 2.2467 1.9732 1.6298 1.6445 1.9529 1.5906 1.6497 3.7194 1.9380 1.1062 1.1716 1.9167 1.6678 1.0742 1.2596 1.6918 1.2851 1.4367 1.8045 1.4152 1.4830 1.3615 1.5921 1.4082 1.5015 1.4688 1.3673 1.2801 1.1080 1.0827 1.0867 1.0913 1.1060 1.8297 7.9661 1.0639 1.0587 1.0614 1.0598 1.0624 1.0840 1.0905 1.1014 1.1003 1.0925 1.1040 1.1043 1.1046 1.0897 1.0780
irintensity: 0.1253 1.6767 4.6652 1.8544 0.8033 5.4104 1.6964 0.5749 0.0921 2.7274 3.1782 9.9314 1.9540 17.7730 2.4768 4.5018 6.8606 14.0776 174.8493 11.3664 70.6384 10.8034 35.0092 0.2232 2.5623 12.6723 2.6279 8.7438 0.5467 0.7252 4.2128 3.9633 0.9227 0.8041 3.1359 0.1441 0.7277 1.8701 12.4575 2.3937 0.3979 2.8554 0.7557 0.5857 12.8622 7.4022 6.5546 1.5733 1.4739 18.2454 2.2310 12.5261 17.7632 0.9685 7.8268 2.2647 3.5227 1.1986 4.7959 30.8173 2.0278 12.4233 14.8342 9.8640 155.1074 221.5268 37.7817 25.4753 13.2080 60.1371 55.5224 15.0493 77.4737 12.6498 13.9239 23.6407 10.3801 38.7585 94.7215 0.7652 31.3824
temp: 298.150 k
press: 1.00000 atm
elementType: 17 17 8 7 6 6 6 6 6 6 6 6 6 6 1 1 1 1 1 1 1 1 1 1 1 1 1 1 1
symmnumber: 1
zpe: 623413.5 jmol-1
zpe.correction: 0.237446 hartree
zpe.thermalcorrener: 0.251409 hartree
zpe.thermalcorrenthalpy: 0.252353 hartree
zpe.thermalcorrgfe: 0.192011 hartree
zpe.sumelectzpe: -1439.071560 hartree
zpe.sumelectthermal: -1439.057597 hartree
zpe.sumelectthermalent: -1439.056653 hartree
zpe.sumelectthermalfe: -1439.116995 hartree
dipole: -2.3077 -0.4498 -2.2537
dipole: 3.2568
quadrupole: -97.9286 -99.2416 -102.7187
quadrupole: -0.1682 -0.0885 2.9845
quadrupole: 2.0344 0.7214 -2.7557 -0.1682 -0.0885 2.9845
hfenergy: -1439.3090061 hartree
pointgroup: C01 [X(C10H15Cl2N1O1)]
dipole: 1.045881 -0.0598829 0.7378161 debye
polarizability: 143.3014543|-2.0007012|121.9225566|-8.5037117|-1.9561892|122.1143353 unknown
InChI: InChI=1S/C10H15Cl2NO/c11-9(12)10(14)13-5-8-4-6-1-2-7(8)3-6/h6-9,13H,1-5H2
charge 0 multiplicity 1
29 atoms
Cl -3.918168 0.108799 2.222345
Cl -3.121791 2.128549 0.043045
O  -2.293694 -1.113841 -1.138451
N  -1.202718 -0.577201 0.860692
C  1.649648 0.764568 0.508996
C  3.503269 -0.441744 -0.05752
C  1.050176 -0.447473 -0.276287
C  2.859913 0.116605 1.24531
C  2.333127 -1.28737 -0.642148
C  2.373813 1.687824 -0.517394
C  3.651317 0.853103 -0.912565
C  0.043476 -1.297341 0.536199
C  -2.254428 -0.53118 -0.011951
C  -3.463047 0.320211 0.405373
H  0.916222 1.298657 1.13737
H  4.442209 -1.006529 0.065818
H  0.529331 -0.096968 -1.186625
H  2.578766 -0.673412 1.965957
H  3.496887 0.856334 1.762639
H  2.434069 -1.447109 -1.730123
H  2.298308 -2.286222 -0.163367
H  2.65469 2.648752 -0.049033
H  1.730419 1.916269 -1.385958
H  3.69119 0.626836 -1.993404
H  4.579059 1.394296 -0.65142
H  0.499889 -1.637259 1.48444
H  -0.230963 -2.191592 -0.052684
H  -1.288173 -0.09265 1.757061
H  -4.347799 0.044187 -0.178716
