program: Gaussian 09
title: 000259253
version: EM64L-G09RevD.01
frameworkgroup: C1[X(C16H13NO3)]
method: RPBEPBE
basis: SDD
operation: Freq
keyword: #p
keyword: freq=noraman
keyword: PBEPBE/SDD
title: #p freq=noraman PBEPBE/SDD
converged: NO YES NO NO
title: Mulliken charges:
elementType: O O O N C C C C C C C C C C C C C C C C H H H H H H H H H H H H H
charge: -0.156544 -0.313012 -0.264899 -0.464800 0.051626 0.326945 0.254190 0.197227 -0.321315 0.347358 -0.459445 -0.346533 -0.425528 -0.355158 -0.219623 -0.259907 -0.229637 0.263575 -0.212449 -0.672892 0.282038 0.215806 0.283164 0.301287 0.237161 0.231542 0.332456 0.239065 0.231305 0.231227 0.215770 0.229996 0.230002
chargesum: 0.00000
title: Mulliken charges with hydrogens summed into heavy atoms:
elementType: O O O N C C C C C C C C C C C C C C C C
charge: -0.156544 -0.313012 -0.264899 -0.132344 0.051626 0.326945 0.254190 0.197227 -0.321315 0.347358 -0.177407 -0.130726 -0.142364 -0.053870 0.017538 -0.028366 0.009428 0.263575 0.250083 0.002877
polarizability: 2.78365912e+02 -1.20920013e+01 2.56368923e+02 -8.60527099e-02 -5.20218092e-02 8.13630430e+01
1716.lowfreq: -4.5852 -0.0006 -0.0001 0.0007 0.5443 2.1081 19.6326 41.5572 46.0681
frequency: 19.5865 41.5535 46.0467 61.7057 85.0439 101.4958 136.3610 153.5133 157.2058 225.7657 228.8635 244.9314 258.8437 281.1347 309.0578 322.3868 379.2442 407.3668 417.3876 443.6440 519.2211 546.0879 556.5928 562.3071 604.4520 629.7553 639.9306 683.0404 687.9091 708.1335 730.7167 745.0971 763.2659 785.0985 798.0456 801.2098 845.8035 850.9362 867.9950 884.6932 937.3620 945.8931 962.0950 990.0282 995.4391 1001.0339 1009.3215 1034.5250 1050.6413 1080.9157 1089.8019 1111.6714 1138.9274 1158.3891 1172.1464 1177.3686 1192.2027 1214.1328 1247.2339 1250.0445 1296.2152 1305.8844 1354.2743 1368.8241 1399.2637 1407.0517 1419.2777 1452.0300 1462.3768 1469.9249 1476.2049 1477.7293 1488.6642 1510.3886 1589.5595 1598.5066 1611.3969 1617.4302 1634.5866 1665.6091 2997.2714 3011.2561 3070.0321 3094.4132 3108.8833 3123.4118 3140.7093 3145.8794 3151.4676 3166.6014 3169.3256 3186.5854 3581.3230
redmass: 3.5128 3.0876 5.4598 4.3526 3.5149 4.2781 3.7723 5.0764 6.3358 3.6806 5.9603 1.2594 5.7616 8.5462 4.6709 6.4759 4.0445 3.1351 5.8588 4.2798 6.4799 3.6653 8.3212 3.4140 6.9938 1.4460 7.7781 6.3990 5.3534 4.6227 5.5316 1.4704 6.3894 1.7272 2.3952 1.0967 5.2285 2.1803 4.6239 1.8502 6.2774 1.4072 1.4808 6.7291 1.3692 1.3463 3.0527 2.2675 3.9378 1.7169 2.4907 2.2219 1.4625 2.4738 2.1418 1.2981 1.3604 2.0895 3.0997 1.1308 1.8452 1.7299 1.5541 4.1210 1.2692 2.7784 2.6821 2.7318 1.0406 4.4591 1.2971 1.8383 1.1026 2.2679 6.4884 7.0221 7.1229 7.0785 10.3902 7.7240 1.0357 1.0581 1.1069 1.0985 1.1028 1.0870 1.0888 1.0879 1.0938 1.0957 1.1002 1.0955 1.0752
irintensity: 0.0689 0.3092 1.8017 0.1733 7.2946 2.1970 2.9749 2.4749 0.2026 1.7394 3.0413 1.4298 5.1485 7.5447 2.8070 6.8884 7.3277 0.0160 1.9530 4.5313 2.1563 9.9726 0.4977 0.1902 4.5179 17.5131 2.1840 0.8573 0.1444 29.6248 7.1203 156.6730 0.1643 0.0306 25.2404 3.1736 25.5016 31.6851 2.4611 2.3098 62.9574 0.2814 4.3822 6.9978 0.1092 4.2930 6.1146 37.1103 264.8045 35.5414 49.8585 12.9029 5.0952 369.2670 44.2836 0.4895 20.2346 34.6400 35.8109 0.0039 56.5918 44.1487 65.0192 34.7823 35.9115 37.6345 163.2362 9.7181 12.6262 58.3184 10.3877 13.6032 19.6054 487.8790 27.0139 5.7742 262.7811 66.5983 102.1635 265.7472 19.8558 25.9897 7.7097 31.2422 44.7592 19.8313 9.0890 6.5768 13.3037 14.2660 21.9100 7.8327 42.5914
temp: 298.150 k
press: 1.00000 atm
elementType: 8 8 8 7 6 6 6 6 6 6 6 6 6 6 6 6 6 6 6 6 1 1 1 1 1 1 1 1 1 1 1 1 1
symmnumber: 1
zpe: 662988.1 jmol-1
zpe.correction: 0.252519 hartree
zpe.thermalcorrener: 0.269647 hartree
zpe.thermalcorrenthalpy: 0.270591 hartree
zpe.thermalcorrgfe: 0.205671 hartree
zpe.sumelectzpe: -896.565085 hartree
zpe.sumelectthermal: -896.547957 hartree
zpe.sumelectthermalent: -896.547013 hartree
zpe.sumelectthermalfe: -896.611933 hartree
dipole: 3.7723 3.7425 0.0011
dipole: 5.3138
quadrupole: -116.8494 -102.4478 -119.1814
quadrupole: 0.0287 0.0412 -0.0128
quadrupole: -4.0232 10.3784 -6.3552 0.0287 0.0412 -0.0128
hfenergy: -896.8176038 hartree
pointgroup: C01 [X(C16H13N1O3)]
dipole: -1.4618319 1.4943911 -0.022696 debye
polarizability: 278.7245871|11.752279|255.9716368|-0.3163906|-2.5949549|81.4016538 unknown
InChI: InChI=1S/C16H13NO3/c1-2-20-16(19)17-13-9-5-8-12-14(13)10-6-3-4-7-11(10)15(12)18/h3-9,17H,2H2,1H3
charge 0 multiplicity 1
33 atoms
O  4.282299 -1.135972 -0.007901
O  -3.762389 0.73803 -0.029267
O  -3.588832 -1.610844 0.008622
N  -1.699178 -0.16468 -0.014781
C  0.722653 -0.536007 -0.011865
C  1.269814 0.856861 -0.032696
C  1.821973 -1.448007 0.000086
C  2.699217 0.770767 -0.033124
C  3.107406 -0.673141 -0.011946
C  -0.597275 -1.054478 -0.002905
C  1.655702 -2.838524 0.02036
C  0.674295 2.136317 -0.050685
C  3.523443 1.903522 -0.050755
C  -0.777426 -2.472973 0.017811
C  0.330861 -3.342989 0.029174
C  1.504655 3.289761 -0.068617
C  2.913968 3.183782 -0.068782
C  -3.053311 -0.475743 -0.008204
C  -5.249033 0.607704 -0.02923
C  -5.81278 2.02423 -0.05634
H  2.528555 -3.498186 0.029017
H  -0.40901 2.299101 -0.051707
H  4.612044 1.784908 -0.050201
H  -1.794666 -2.870287 0.024527
H  0.153636 -4.423412 0.044993
H  1.038114 4.281023 -0.082646
H  -1.501041 0.834932 -0.030549
H  3.528995 4.089431 -0.082765
H  -5.546609 0.016927 -0.914315
H  -5.549506 0.049935 0.876051
H  -6.917155 1.983898 -0.057609
H  -5.488147 2.596392 0.829414
H  -5.484876 2.563227 -0.961468
