program: Gaussian 09
title: 000259238
version: EM64L-G09RevD.01
frameworkgroup: C1[X(C14H7Cl2NO2)]
method: RPBEPBE
basis: SDD
operation: Freq
keyword: #p
keyword: freq=noraman
keyword: PBEPBE/SDD
title: #p freq=noraman PBEPBE/SDD
converged: NO YES NO YES
title: Mulliken charges:
elementType: Cl Cl O O N C C C C C C C C C C C C C C H H H H H H H
charge: -0.040142 -0.039561 -0.134306 -0.233887 -0.407124 0.331907 0.292616 0.248256 0.206443 -0.305634 -0.543083 -0.422517 -0.377601 0.660632 -0.389480 -0.417493 -0.198602 -0.105917 -0.062679 0.354518 0.272371 0.252032 0.303654 0.260441 0.314571 0.180588
chargesum: 0.00000
title: Mulliken charges with hydrogens summed into heavy atoms:
elementType: Cl Cl O O N C C C C C C C C C C C C C C
charge: -0.040142 -0.039561 -0.134306 -0.233887 -0.092553 0.331907 0.292616 0.248256 0.206443 -0.305634 -0.188566 -0.150147 -0.125569 0.660632 -0.085826 -0.417493 0.061839 -0.105917 0.117908
polarizability: 3.60495784e+02 -5.86182777e+00 2.04904456e+02 -2.38472392e-02 6.27568211e-04 6.56529477e+01
1716.lowfreq: -4.4881 -0.0028 -0.0018 -0.0016 1.4283 8.2413 37.7246 56.9078 87.2266
frequency: 37.7243 56.8911 87.2262 94.0071 125.5109 149.7173 150.6742 193.6706 199.1615 230.0696 250.2184 262.9955 318.5208 319.2574 329.5678 404.0911 435.5852 439.9253 443.2988 459.8112 504.2165 539.4375 593.8974 618.9837 623.2971 662.9364 691.0526 716.3215 719.1156 729.8216 762.1677 820.8822 822.2413 838.2696 867.4038 884.3532 923.1545 949.8608 959.6530 974.3860 978.3297 1013.9542 1056.2331 1087.6691 1102.6808 1134.9234 1174.0134 1197.3488 1230.5152 1257.3039 1292.7809 1343.2985 1364.2326 1382.8222 1414.4543 1435.7877 1438.8576 1478.5946 1501.2372 1584.8667 1592.7970 1598.2862 1618.7115 1633.8988 1643.3074 2949.4579 3143.5697 3164.1249 3168.5735 3171.9041 3180.0967 3477.1011
redmass: 12.3774 8.5955 7.1485 11.4900 6.2796 11.6868 5.8054 4.2025 16.0162 12.4384 6.1279 13.9809 9.3984 4.1199 8.6074 3.4191 9.5777 5.2153 3.4047 7.4333 4.4550 6.0269 7.6818 4.7497 7.3075 7.9052 1.5687 7.6313 2.6397 6.1928 3.3204 7.1954 3.4685 1.5050 8.0710 1.5556 1.4998 1.6198 1.3919 1.5232 4.5558 6.0230 1.9017 2.7368 2.6728 2.4921 2.8231 2.4446 1.2828 1.4395 3.2432 3.9207 4.5798 1.3524 3.8357 3.0444 4.0466 4.9504 2.3389 7.4870 8.0697 8.0681 8.0677 6.4404 6.7666 1.0873 1.0901 1.0932 1.0937 1.0960 1.0940 1.0768
irintensity: 0.0010 0.2543 13.3589 0.7297 2.7272 5.9546 2.3912 1.3841 0.8760 0.6616 3.3357 8.1707 7.9982 10.3920 10.8390 10.0771 18.3400 0.5350 2.6429 4.6347 18.3726 2.5189 6.3398 0.1132 6.7672 12.3251 43.3281 27.8108 40.8213 0.2109 0.8909 60.4387 34.6582 28.2261 11.6880 11.3995 4.7285 0.7370 0.0374 35.3741 32.0532 13.1719 8.1638 13.5027 86.0892 22.8720 108.4556 9.9569 10.8059 0.5513 60.2069 65.7406 6.6382 26.4880 113.2868 185.0210 15.7563 32.0722 486.9335 92.9789 8.9595 103.3590 80.8235 22.3216 218.8770 128.6601 5.4514 0.3639 0.2564 5.2188 13.5433 45.0596
temp: 298.150 k
press: 1.00000 atm
elementType: 17 17 8 8 7 6 6 6 6 6 6 6 6 6 6 6 6 6 6 1 1 1 1 1 1 1
symmnumber: 1
zpe: 454587.6 jmol-1
zpe.correction: 0.173143 hartree
zpe.thermalcorrener: 0.188658 hartree
zpe.thermalcorrenthalpy: 0.189602 hartree
zpe.thermalcorrgfe: 0.129195 hartree
zpe.sumelectzpe: -1661.741382 hartree
zpe.sumelectthermal: -1661.725868 hartree
zpe.sumelectthermalent: -1661.724923 hartree
zpe.sumelectthermalfe: -1661.785330 hartree
dipole: -2.0032 -6.1336 0.0001
dipole: 6.4524
quadrupole: -110.6103 -133.6466 -124.6432
quadrupole: 4.0241 0.0007 -0.0010
quadrupole: 12.3564 -10.6799 -1.6765 4.0241 0.0007 -0.0010
hfenergy: -1661.9145253 hartree
pointgroup: C01 [X(C14H7Cl2N1O2)]
dipole: -0.5784414 2.4717954 -0.0000207 debye
dipolederiv: -0.4913129 0.3508786 -0.0000248 0.4213334 -0.5411837 0.000023 -0.0000014 0.0000019 -0.0435723 -1.055103 0.1509057 -0.0001282 0.2256814 -0.1432012 0.0000308 -0.0001554 0.00003 -0.0562084 -0.5267153 0.0030071 -0.0000272 0.0389165 -1.0006855 -0.0001221 -0.0000234 0.0001415 -0.2850621 -0.3615504 0.1798499 -0.0000436 -0.7183161 -1.0772444 0.000055 -0.0002448 -0.0002832 -0.3391285 -1.6868081 -0.587411 -0.0001434 -0.8965991 -0.8118944 -0.0001264 -0.0001192 0.0000055 -0.2968273 0.1922842 -0.1631361 0.0000332 -0.0946671 0.048817 -0.0000032 0.0001372 -0.0000408 -0.0063141 0.3374075 0.1429145 0.0000121 0.0203478 -0.0146704 0.0000118 -0.000084 0.0000005 -0.0103755 -0.6509409 0.3439659 -0.000051 0.1122697 -0.2186989 0.0000133 -0.0000206 -0.0000013 0.0217129 -0.6532244 -0.2078982 -0.0000588 -0.1580004 -0.1620244 -0.0000099 -0.0001181 -0.0000367 0.0386283 1.3587297 -0.0742566 0.0001085 -0.0606414 1.2244125 0.0001152 0.0001156 -0.0000425 0.1162561 -0.01252 -0.2296659 0.0000029 0.2483702 0.0504096 0.0000134 -0.0000118 -0.0000108 -0.1087755 -0.2781367 0.1964758 0.0000005 0.2541682 -0.0855501 0.0000075 -0.0000251 0.000015 -0.0815041 -0.1927704 -0.1280725 -0.0000075 -0.0230564 0.1006112 -0.0000083 0.0000169 -0.0000071 -0.1365792 1.17701 0.4771121 0.0000675 0.2875141 -0.2300495 0.0000241 0.0000081 0.0000032 0.1029613 -0.2105217 0.070502 -0.0000255 -0.1159397 0.0622798 -0.0000079 -0.0000316 0.000012 -0.0658576 0.4166982 -0.6034994 -0.0000034 -0.887774 0.719692 -0.0000536 0.000074 -0.0000055 -0.0949653 -0.2253472 0.147694 -0.0000088 0.2310946 -0.0451992 0.0000215 -0.0000242 0.0000227 -0.0834283 1.4249442 -0.2505178 0.0002113 -0.3898917 0.1031235 -0.0000533 0.0002486 -0.0000514 -0.0847259 1.1130973 0.1863425 0.0001782 1.3063595 1.6697848 0.0000341 0.0006171 0.0002627 0.1533897 0.1607427 0.0184655 0.0000014 0.0253504 0.1013339 0.0000029 0.0000168 -0.0000039 0.181289 0.0879317 -0.0542951 -0.0000039 -0.0407024 -0.0033287 -0.0000022 -0.0000308 -0.000006 0.1594826 0.0674611 0.0717267 -0.0000127 0.0344303 -0.0592212 0.0000059 0.0000062 0.000002 0.1546729 0.1045436 0.0036684 -0.0000098 0.044587 0.0352801 0.0000069 -0.0000104 -0.0000056 0.1659369 0.005189 -0.0685403 -0.0000191 -0.0692646 0.0435668 -0.0000079 -0.0000357 -0.0000109 0.1622574 0.1804453 -0.0114415 0.0000046 0.03104 0.2091079 0.0000073 0.0000394 0.0000348 0.3108074 -0.2815334 0.0352256 -0.0000526 0.1733899 0.0245326 0.0000223 -0.0003435 -0.0000264 0.1259296 unknown
polarizability: 360.3542581|-7.5074128|205.0459823|0.0238133|-0.0014181|65.6529477 unknown
InChI: InChI=1S/C14H7Cl2NO2/c15-7-1-2-8-9-4-12(16)13(17-6-18)5-11(9)14(19)10(8)3-7/h1-6,17H
charge 0 multiplicity 1
26 atoms
Cl -3.340702 3.010014 -0.000395
Cl 6.012188 -0.52316 0.000508
O  0.634253 -2.801229 -0.000064
O  -4.403812 -2.248766 -0.000698
N  -4.141871 0.10386 -0.000366
C  0.070183 0.759962 -0.000309
C  1.552226 0.689607 -0.000186
C  -0.455286 -0.566294 -0.000309
C  1.933962 -0.685669 -0.000111
C  0.693203 -1.543318 -0.000398
C  -1.827772 -0.836072 -0.000311
C  -0.808718 1.855265 -0.000344
C  2.539918 1.690583 -0.00006
C  -2.737075 0.266163 -0.000345
C  3.276586 -1.088272 0.000118
C  -2.191721 1.583836 -0.00037
C  3.906032 1.304815 0.000149
C  4.250675 -0.064096 0.000242
C  -4.875626 -1.08268 -0.000293
H  -2.214942 -1.857655 -0.00032
H  -0.457767 2.890834 -0.000324
H  2.282728 2.754886 -0.00009
H  3.550079 -2.147263 0.000158
H  4.695003 2.062651 0.000258
H  -4.685899 0.973988 -0.000445
H  -5.969047 -0.873891 -0.000794
