program: Gaussian 09
title: 000259302
version: EM64L-G09RevD.01
frameworkgroup: C1[X(C23H23NO)]
method: RPBEPBE
basis: SDD
operation: Freq
keyword: #p
keyword: freq=noraman
keyword: PBEPBE/SDD
title: #p freq=noraman PBEPBE/SDD
converged: NO YES NO NO
title: Mulliken charges:
elementType: O N C C C C C C C C C C C C C C C C C C C C C C C H H H H H H H H H H H H H H H H H H H H H H H
charge: -0.468055 -0.447731 -0.127761 -0.272307 -0.286128 -0.493346 -0.569206 0.188483 0.330249 0.304711 -0.423138 0.287714 -0.544867 0.155557 -0.425867 -0.392867 0.431282 -0.403199 -0.487202 -0.364113 -0.264354 -0.243124 -0.438824 -0.272766 -0.247674 0.218971 0.232163 0.211401 0.232933 0.198932 0.228472 0.218968 0.296516 0.210163 0.224257 0.216675 0.251547 0.227647 0.231359 0.383311 0.234871 0.232476 0.287690 0.228438 0.228486 0.234578 0.221821 0.222859
chargesum: 0.00000
title: Mulliken charges with hydrogens summed into heavy atoms:
elementType: O N C C C C C C C C C C C C C C C C C C C C C C C
charge: -0.084745 -0.151215 0.091211 -0.040144 -0.074728 -0.061481 -0.121766 0.188483 0.330249 0.304711 0.011282 0.287714 -0.076645 0.155557 -0.198220 -0.161509 0.431282 -0.168329 -0.254726 -0.076423 -0.035916 -0.014638 -0.204246 -0.050945 -0.024815
polarizability: 2.78996970e+02 -3.05734562e+00 2.83448344e+02 1.51608138e+01 -1.75905350e+01 1.91879081e+02
1716.lowfreq: -8.6586 -0.0010 -0.0006 0.0005 6.1885 8.6856 29.5770 35.2449 40.4885
frequency: 29.4948 35.2027 40.3664 74.8048 94.7779 118.6249 128.5365 157.4141 183.3150 208.4791 224.0707 233.6776 263.7307 280.1029 310.5289 337.0662 355.4426 375.4348 391.4757 414.9527 425.8078 447.5775 458.8815 466.3734 477.9570 497.2866 515.4725 526.3688 548.0831 568.5886 582.9325 615.5123 634.1572 660.9080 690.4693 694.2127 718.9526 746.3592 751.5024 753.1273 758.4514 790.1783 797.4225 806.9355 821.8598 833.6294 856.0123 867.9992 876.9791 883.8278 894.5447 920.9539 928.2028 950.7419 954.2936 958.3017 972.1087 973.5774 987.0847 988.2824 998.1260 1011.0212 1031.5965 1038.2148 1045.0644 1058.0234 1071.8441 1086.3385 1112.6948 1122.1707 1133.1842 1152.3923 1164.1331 1171.5056 1175.7855 1187.5643 1193.2963 1195.6303 1201.8269 1215.1763 1220.5429 1232.3642 1235.9164 1255.7021 1258.6301 1276.1834 1292.0749 1299.8405 1310.5370 1313.1238 1328.1155 1340.1736 1344.6953 1360.2962 1364.5015 1375.0371 1385.5697 1407.3420 1423.3759 1429.0452 1430.8458 1441.3517 1449.7804 1454.2319 1465.7590 1470.4586 1477.2420 1489.1099 1507.5779 1523.0829 1582.0570 1590.4697 1605.6524 1615.6354 1633.4405 2854.0196 2878.4118 2921.8370 2933.1953 2948.0167 2968.7687 2982.8665 2985.5244 3013.7225 3034.5146 3045.4779 3050.2419 3107.1633 3115.1117 3115.4320 3119.7553 3130.6476 3135.0546 3139.5401 3151.0412 3161.2659 3170.2008 3449.5106
redmass: 4.5376 4.4263 4.9155 5.1541 4.4130 4.3254 3.5953 3.7163 3.6523 3.2225 2.9809 4.1223 3.9764 3.0368 3.2452 3.0750 3.9088 4.1465 4.5870 3.6215 3.0038 3.7432 3.7758 3.4226 3.5476 3.0915 5.3205 4.1067 4.0575 3.1245 2.7332 3.3721 4.0292 4.3999 3.5210 4.2101 4.1503 1.4502 2.4525 1.3616 2.6600 2.9003 3.2136 2.6319 1.6624 2.5053 2.0754 2.0348 1.7413 2.2942 2.6365 2.6097 2.1690 1.4073 1.3439 1.2329 2.6829 1.4943 1.3269 1.3484 2.1712 2.5573 2.2803 2.4234 2.5486 2.0522 2.7317 2.1415 2.4750 1.8485 2.8128 1.4134 1.3401 1.2064 1.0727 1.4803 1.3224 1.6121 1.6353 1.4255 1.9638 1.5290 2.0547 1.2425 1.5036 1.6793 1.2777 1.3926 1.2375 1.3178 1.6289 1.5152 1.4666 1.4745 2.1520 2.2149 2.8093 3.0878 3.4627 3.2246 1.4143 2.3214 1.1289 1.2088 1.0977 2.0995 1.1179 2.3387 1.7341 1.9825 7.8763 6.8961 5.8119 6.4072 6.6715 1.0740 1.0791 1.0707 1.0817 1.0653 1.0604 1.0615 1.0831 1.0939 1.1019 1.0979 1.0945 1.0861 1.0864 1.0861 1.0889 1.0902 1.0970 1.0929 1.0963 1.1005 1.0970 1.0744
irintensity: 0.3065 0.0308 1.1433 3.3316 2.8063 0.8354 0.5900 3.1114 1.9146 0.3054 1.2209 2.0051 4.3345 1.6068 1.6370 4.0084 1.7129 2.1470 2.8577 2.2657 3.5260 8.6024 5.2920 0.1411 9.1974 0.2362 1.9732 1.1125 2.8351 8.5729 10.3479 8.5652 1.1160 2.7484 4.2186 6.3399 3.2120 111.0704 5.1252 25.0478 10.4889 22.2083 3.7735 1.9432 18.7781 46.1611 13.0612 1.8202 2.4978 10.6845 21.1614 6.9353 11.7855 2.7350 2.8092 68.5475 8.3947 3.1321 0.2031 0.5245 29.6278 4.7415 9.1759 9.1809 6.0769 2.5378 12.2271 2.0172 4.1403 19.2828 10.7794 0.8325 4.3070 4.3195 0.2352 0.4569 0.1707 8.1429 0.6599 0.9884 10.1423 2.6622 7.8385 17.7958 0.1122 1.9277 5.7404 16.5416 17.5364 7.1111 1.1293 6.2810 1.1521 10.3388 14.9963 3.0078 2.1114 2.1391 5.6052 1.6864 18.5734 8.4458 19.2549 6.3138 3.9604 1.0938 1.3382 24.3795 34.6440 75.9778 0.4915 1.6078 5.7885 1.8265 5.7755 913.2630 214.8803 12.9069 61.8054 30.8115 77.1839 17.0701 17.4227 34.1302 45.0944 33.5066 39.4382 8.9304 14.2098 1.6281 3.0649 12.1229 45.2994 26.5288 38.8817 28.6824 14.2743 0.7373
temp: 298.150 k
press: 1.00000 atm
elementType: 8 7 6 6 6 6 6 6 6 6 6 6 6 6 6 6 6 6 6 6 6 6 6 6 6 1 1 1 1 1 1 1 1 1 1 1 1 1 1 1 1 1 1 1 1 1 1 1
symmnumber: 1
zpe: 1051673.5 jmol-1
zpe.correction: 0.400561 hartree
zpe.thermalcorrener: 0.420143 hartree
zpe.thermalcorrenthalpy: 0.421087 hartree
zpe.thermalcorrgfe: 0.352538 hartree
zpe.sumelectzpe: -1018.468324 hartree
zpe.sumelectthermal: -1018.448742 hartree
zpe.sumelectthermalent: -1018.447798 hartree
zpe.sumelectthermalfe: -1018.516347 hartree
dipole: -3.8510 -2.2795 1.0528
dipole: 4.5972
quadrupole: -134.9767 -131.3096 -146.4067
quadrupole: 0.3229 8.9135 -0.7936
quadrupole: 2.5876 6.2547 -8.8424 0.3229 8.9135 -0.7936
hfenergy: -1018.8688849 hartree
pointgroup: C01 [X(C23H23N1O1)]
dipole: 1.5119395 0.8718298 0.4746895 debye
polarizability: 278.8770013|-1.7851747|280.2056466|-15.8824112|24.2827314|195.2417471 unknown
InChI: InChI=1S/C23H23NO/c25-23-20(22-19-8-4-2-6-16(19)13-14-24-22)12-11-17-10-9-15-5-1-3-7-18(15)21(17)23/h1-10,20,22-25H,11-14H2
charge 0 multiplicity 1
48 atoms
O  0.102777 0.384502 -1.629435
N  2.406633 1.68374 -1.284413
C  0.729104 1.464611 0.54538
C  2.248825 1.382501 0.178196
C  -0.121295 0.378436 -0.169181
C  0.125076 2.861773 0.279524
C  -1.257559 2.944003 0.954766
C  -1.617135 0.550305 0.096493
C  2.87138 0.026741 0.543608
C  -2.139224 1.739352 0.634583
C  3.688955 1.240459 -1.889731
C  3.555209 -0.779003 -0.408378
C  3.731248 -0.296136 -1.841187
C  -2.505356 -0.54896 -0.214705
C  -3.544342 1.840662 0.908401
C  2.782228 -0.42283 1.886397
C  -3.918733 -0.435897 0.082276
C  4.102662 -2.021639 -0.000539
C  -4.411908 0.783485 0.652913
C  -2.036226 -1.762021 -0.824395
C  3.328898 -1.659756 2.283378
C  3.987971 -2.471562 1.3306
C  -4.794251 -1.534458 -0.205089
C  -2.912114 -2.816784 -1.094998
C  -4.302799 -2.7091 -0.777632
H  0.654142 1.274139 1.635612
H  2.768547 2.161466 0.788133
H  0.197857 -0.608712 0.23225
H  0.006038 3.015784 -0.810931
H  0.786994 3.660472 0.671942
H  -1.782149 3.870667 0.65128
H  -1.121517 3.014972 2.0555
H  2.219962 2.679622 -1.461794
H  4.573392 1.658135 -1.356152
H  3.717536 1.601569 -2.933383
H  4.689617 -0.664403 -2.251951
H  2.921022 -0.695012 -2.482551
H  -3.930671 2.777619 1.329762
H  2.28086 0.203321 2.634251
H  1.02033 0.830907 -1.760087
H  4.630851 -2.636219 -0.740255
H  -5.482169 0.873346 0.875174
H  -0.985425 -1.836008 -1.117241
H  3.244373 -1.987628 3.325195
H  4.416382 -3.435524 1.626488
H  -5.861002 -1.433664 0.0302
H  -2.535089 -3.731691 -1.56598
H  -4.977804 -3.544683 -0.994693
