program: Gaussian 09
title: 000259239
version: EM64L-G09RevD.01
frameworkgroup: C1[X(C14H8BrNO2)]
method: RPBEPBE
basis: SDD
operation: Freq
keyword: #p
keyword: freq=noraman
keyword: PBEPBE/SDD
title: #p freq=noraman PBEPBE/SDD
converged: NO YES NO NO
title: Mulliken charges:
elementType: Br O O N C C C C C C C C C C C C C C H H H H H H H H
charge: 0.032991 -0.141298 -0.235265 -0.412820 0.290669 0.279997 0.259457 0.214680 -0.307197 -0.543853 -0.377854 -0.392298 0.683403 -0.413743 -0.532416 -0.217511 -0.229751 -0.063470 0.355402 0.265773 0.246920 0.281792 0.233139 0.238304 0.306978 0.177972
chargesum: 0.00000
title: Mulliken charges with hydrogens summed into heavy atoms:
elementType: Br O O N C C C C C C C C C C C C C C
charge: 0.032991 -0.141298 -0.235265 -0.105842 0.290669 0.279997 0.259457 0.214680 -0.307197 -0.188451 -0.112081 -0.145377 0.683403 -0.131951 -0.532416 0.015627 0.008552 0.114502
polarizability: 3.20987461e+02 -1.71124160e+01 2.19248211e+02 1.45558169e-02 6.25862334e-03 6.41223244e+01
1716.lowfreq: -6.6800 -2.7426 -0.0006 0.0003 0.0004 4.5803 42.7803 67.7226 83.8158
frequency: 42.7793 67.7219 83.8148 109.2831 137.3071 138.5161 176.2750 209.4849 211.7733 223.4985 272.4819 293.8749 354.5265 388.8339 426.9843 429.4494 443.5985 496.4830 522.6817 569.3570 585.8011 620.7414 650.6203 688.1591 697.7689 719.7010 724.1906 754.9035 779.9769 813.0700 837.4375 844.0303 887.1164 901.1926 948.8415 964.8095 965.4430 977.5853 998.6075 999.8153 1028.7794 1078.4147 1095.5765 1127.7232 1167.0379 1187.0449 1199.1479 1233.6741 1272.4176 1297.2797 1339.7907 1377.7011 1388.4562 1431.2664 1439.6665 1448.1149 1479.5593 1499.8432 1581.4626 1599.5090 1602.7813 1619.9731 1634.7836 1643.5826 2945.0311 3130.2667 3142.3722 3153.4022 3161.9249 3169.0781 3177.3260 3465.6121
redmass: 8.8653 7.0938 5.1852 8.1409 10.2515 5.4756 3.8606 9.3351 5.7683 18.4393 9.1377 3.8206 7.7201 3.5137 4.3466 6.8599 3.2003 4.2310 6.3945 7.5499 7.5162 4.5408 7.2658 1.4680 6.8177 2.6650 6.0426 1.6671 2.4098 7.2157 3.1582 7.5279 1.4483 1.6175 1.6140 4.8355 1.4057 1.5315 1.3658 5.1107 2.1653 2.6321 2.0890 3.5441 1.2935 2.1250 2.4310 1.3045 2.0663 2.0901 4.1755 2.3644 1.7725 3.9255 2.6698 2.7133 4.4437 2.3463 7.1971 7.5696 7.5926 7.7744 6.7027 6.4328 1.0871 1.0868 1.0898 1.0946 1.0930 1.1003 1.0939 1.0769
irintensity: 0.0145 0.4571 16.7636 1.0306 5.4866 0.0144 2.9730 1.4269 0.4762 0.4150 13.5941 13.5762 5.4181 9.4566 0.4927 5.8994 4.0752 7.1844 1.9509 7.1914 7.4546 2.2244 6.6909 28.9045 5.4226 74.3177 0.3637 35.1879 42.2342 23.5190 0.6878 26.2548 12.5864 0.4990 0.2919 75.5599 1.1156 33.3949 0.5006 11.9906 3.6350 12.3795 42.0022 18.4052 9.8722 24.3987 12.3628 13.8293 7.4288 52.8959 75.3869 2.2498 69.2192 57.3357 13.6215 91.7330 17.7047 475.1100 72.4555 111.3344 95.8521 49.9297 36.2483 226.0479 125.0213 2.8280 4.8807 11.8460 1.2037 32.1135 14.4074 49.5023
temp: 298.150 k
press: 1.00000 atm
elementType: 35 8 8 7 6 6 6 6 6 6 6 6 6 6 6 6 6 6 1 1 1 1 1 1 1 1
symmnumber: 1
zpe: 478967.6 jmol-1
zpe.correction: 0.182429 hartree
zpe.thermalcorrener: 0.196846 hartree
zpe.thermalcorrenthalpy: 0.197790 hartree
zpe.thermalcorrgfe: 0.139646 hartree
zpe.sumelectzpe: -755.751639 hartree
zpe.sumelectthermal: -755.737222 hartree
zpe.sumelectthermalent: -755.736278 hartree
zpe.sumelectthermalfe: -755.794422 hartree
dipole: -0.6003 -5.9749 -0.0005
dipole: 6.0050
quadrupole: -84.3608 -128.5831 -116.0660
quadrupole: -7.1624 0.0038 0.0007
quadrupole: 25.3092 -18.9131 -6.3961 -7.1624 0.0038 0.0007
hfenergy: -755.9340677 hartree
pointgroup: C01 [X(C14H8Br1N1O2)]
dipole: 0.3840641 2.331117 0.000197 debye
dipolederiv: -0.3600534 0.2996146 0.0000808 0.3736885 -0.4985019 -0.0000999 0.0001583 -0.0001393 -0.0067561 -0.5288798 -0.0130985 -0.0000417 0.0550461 -1.0452251 -0.000565 0.000007 0.0006098 -0.2906225 -0.3746436 0.1603189 -0.0000054 -0.694246 -1.1019371 0.0000799 -0.0003539 -0.0004776 -0.3402501 -1.600893 -0.6061911 0.0000477 -0.8508825 -0.828055 -0.0000114 0.0001154 0.0000923 -0.2956209 0.1349666 -0.1328076 0.0000522 -0.1089398 0.0489821 0.0000204 0.0004655 -0.0001141 -0.0076107 0.3979436 0.1100178 -0.0000607 0.0439865 0.0247716 0.0000475 -0.0004675 -0.0000716 -0.0027462 -0.6103471 0.3696685 0.00005 0.1511151 -0.2277833 0.0000194 0.0002334 -0.0001635 0.0302976 -0.7572475 -0.1725086 -0.0000441 -0.0641884 -0.2158844 0.0000054 -0.0002082 -0.0000767 0.0332644 1.3672387 -0.0759748 0.0000269 -0.1283788 1.2660651 0.0005413 -0.000073 -0.0001187 0.1135279 0.0038122 -0.26923 -0.0000263 0.2397502 0.0296836 -0.0000082 0.0000283 0.000077 -0.1131489 -0.2820921 0.2025952 0.0000892 0.3370048 -0.1373543 -0.0000776 0.0000216 -0.0000159 -0.067931 -0.3716216 -0.1251088 -0.0000394 -0.0489256 0.0905491 -0.0000054 0.0000431 0.0000334 -0.14713 1.0761222 0.5502375 -0.0001113 0.2558922 -0.2705046 -0.0000747 -0.0002658 -0.0002365 0.1191492 0.1493779 0.0255199 0.0000439 -0.1527465 0.1456669 0.0000216 0.0000493 0.0000104 -0.1109083 0.3418334 -0.6579567 -0.0002294 -0.8999428 0.7812733 0.0002197 -0.0001597 0.0002697 -0.1656666 0.1603379 0.1106578 0.000109 0.1150394 0.0408485 0.0000042 0.0000951 0.0000262 -0.1265484 0.0108044 -0.0436031 0.0001026 -0.0874179 -0.1132 -0.0000294 0.0000852 -0.0000465 -0.1713355 1.1116885 0.2222627 -0.0000059 1.239327 1.6852318 0.0000201 0.0005494 0.0004739 0.1515139 0.1555303 0.028274 0.0000101 0.0228769 0.0972438 -0.0000105 0.0000564 -0.0000358 0.1806587 0.0835148 -0.062374 0.0000026 -0.0458127 -0.0111342 -0.0000105 -0.000079 -0.0000185 0.1539317 0.0865868 0.0690067 -0.0000123 0.0255657 -0.0767518 -0.0000084 0.000065 -0.0000353 0.154691 0.0902115 0.0040317 -0.0000198 0.0634726 -0.0272531 -0.0000039 -0.0000446 -0.0000376 0.1593944 -0.0488036 -0.0925144 -0.0000405 -0.1204174 -0.0003032 -0.000032 -0.0001164 -0.0000408 0.1556118 -0.1210907 0.0462493 -0.0000705 0.0517131 0.0784772 0.0000211 -0.0000886 0.0000539 0.1654731 0.1591901 0.0160886 0.0000424 0.0464053 0.2461059 -0.0000244 0.0000888 0.0000333 0.3033741 -0.2734864 0.0368241 0.0000498 0.1810154 0.018989 -0.0000395 -0.000205 -0.0000515 0.1253876 unknown
polarizability: 322.6935701|-10.7863686|217.5421026|-0.012424|0.0098329|64.1223244 unknown
InChI: InChI=1S/C14H8BrNO2/c15-12-5-10-8-3-1-2-4-9(8)14(18)11(10)6-13(12)16-7-17/h1-7,16H
charge 0 multiplicity 1
26 atoms
Br -2.990034 3.19174 0.000584
O  0.881935 -2.864793 0.000158
O  -4.122855 -2.183561 -0.00005
N  -3.806706 0.163417 0.000597
C  0.422047 0.710823 -0.000499
C  1.903041 0.597127 -0.000494
C  -0.140864 -0.598802 -0.00048
C  2.244557 -0.789268 -0.000466
C  0.982049 -1.608377 -0.001298
C  -1.519748 -0.826222 -0.000072
C  -0.425106 1.830864 -0.000221
C  2.914253 1.573289 -0.000202
C  -2.398972 0.301423 0.000229
C  3.580372 -1.217949 0.000007
C  -1.819222 1.606451 0.000119
C  4.26844 1.143573 0.000183
C  4.601827 -0.233163 0.000318
C  -4.56621 -1.006373 0.000679
H  -1.937225 -1.835922 -0.000119
H  -0.03668 2.852941 -0.000153
H  2.678017 2.64299 -0.000147
H  3.816684 -2.287053 -0.000017
H  5.069778 1.890784 0.000451
H  5.654259 -0.53563 0.000624
H  -4.336245 1.042712 0.000783
H  -5.654791 -0.771924 0.000482
