program: Gaussian 09
title: 000259327
version: EM64L-G09RevD.01
frameworkgroup: C1[X(C18H35N3O4)]
method: RPBEPBE
basis: SDD
operation: Freq
keyword: #p
keyword: freq=noraman
keyword: PBEPBE/SDD
title: #p freq=noraman PBEPBE/SDD
converged: NO YES NO NO
title: Mulliken charges:
elementType: O O O O N N N C C C C C C C C C C C C C C C C C C H H H H H H H H H H H H H H H H H H H H H H H H H H H H H H H H H H H
charge: -0.270112 -0.328713 -0.406127 -0.234728 -0.367211 -0.383247 -0.645355 -0.211870 -0.473079 -0.003348 -0.157987 -0.400610 -0.240430 -0.444997 0.211560 -0.038048 -0.003519 0.224268 -0.714799 -0.723137 -0.720081 -0.708169 -0.711710 -0.710354 0.140042 0.279696 0.227164 0.227336 0.189796 0.291216 0.232928 0.208535 0.245741 0.199177 0.253571 0.222207 0.362438 0.187993 0.370108 0.212032 0.211015 0.214768 0.226991 0.211210 0.211025 0.212253 0.208991 0.213089 0.217893 0.210784 0.227560 0.217409 0.215979 0.209037 0.213308 0.215031 0.212153 0.287680 0.296874 0.378776
chargesum: 0.00000
title: Mulliken charges with hydrogens summed into heavy atoms:
elementType: O O O O N N N C C C C C C C C C C C C C C C C C C
charge: -0.270112 -0.328713 -0.027352 -0.234728 -0.004773 -0.013139 -0.060802 0.067826 -0.018580 0.186447 0.133230 0.040853 0.005311 0.007750 0.211560 0.184159 0.184473 0.224268 -0.076984 -0.073910 -0.085748 -0.051932 -0.069285 -0.069862 0.140042
polarizability: 2.44449056e+02 2.31351020e+00 2.50943247e+02 -1.70629337e+00 -5.82319814e+00 1.96822450e+02
1716.lowfreq: -11.2027 -9.2911 -5.3716 -2.7421 -0.0005 -0.0001 0.0003 10.0349 11.5395
frequency: -8.9776 8.5914 10.3413 30.4925 34.7883 38.1383 44.4017 51.6413 59.9677 62.1243 71.8572 77.9688 88.3512 92.1882 118.3725 137.2734 166.9004 186.0366 191.0562 206.7588 211.9965 214.5306 217.0840 229.6635 238.2843 243.8413 247.8198 254.8974 269.7038 286.4970 300.0158 310.8152 333.0443 342.2425 366.1903 387.8991 393.0689 397.8551 411.6106 415.9204 416.5626 446.7706 476.0996 488.8378 521.9818 556.2489 561.8479 605.1995 641.4665 656.7276 682.3852 710.0675 728.6251 750.7174 774.6382 805.3711 807.6643 817.7969 828.0962 838.1021 840.1053 842.5843 890.9193 905.1466 912.9024 915.2733 922.3227 932.0110 942.2408 946.2329 956.5617 958.6609 960.8189 963.7049 986.8950 995.7300 1023.7885 1056.0693 1061.7591 1095.6512 1110.5294 1120.4242 1127.7064 1140.3907 1144.6046 1155.6894 1165.0903 1173.1561 1178.5870 1180.7318 1185.4835 1202.1346 1221.5939 1232.9588 1245.7072 1254.8094 1257.4648 1268.0538 1276.1339 1291.9155 1299.1478 1311.0376 1313.3807 1320.9319 1329.7629 1332.3039 1335.4688 1338.1460 1343.7548 1346.1065 1353.5380 1356.1574 1378.7594 1378.8452 1380.2856 1396.4507 1397.4955 1399.8784 1452.5381 1452.8691 1457.2050 1468.2039 1468.8000 1468.9566 1470.4540 1471.8977 1472.5631 1479.8757 1481.9289 1482.6930 1483.4728 1489.7404 1490.3980 1491.4588 1525.2040 1579.4226 1624.0784 1640.1883 1649.8168 2944.2146 2957.0272 2959.3796 2966.3264 2968.2294 2968.4483 2971.1538 2971.4491 2973.7023 2974.7040 2975.2497 2988.6476 2991.7928 2997.3062 3002.0461 3045.5230 3050.5420 3052.7893 3060.6649 3061.5957 3062.2076 3065.1952 3066.8983 3067.2180 3069.2444 3070.0848 3070.3013 3072.1276 3073.4337 3075.0837 3312.2080 3358.8400 3461.7715 3508.0191 3588.1330
redmass: 4.0686 3.8638 2.6892 3.4086 2.8672 4.0990 5.1377 4.4539 4.0401 3.8630 3.8789 3.7625 5.0451 3.4467 2.7994 3.6078 3.4000 2.3337 2.3921 1.1807 1.9943 1.0836 1.1782 1.8477 1.3528 1.7498 1.6011 1.2198 4.0764 4.4484 5.3837 2.9828 2.4237 2.9238 2.3948 2.4842 2.3456 2.5682 2.7099 2.0816 2.3320 2.2228 3.7249 3.4099 5.2126 3.8618 3.6624 3.0025 1.6084 3.0170 2.0299 3.9400 3.5646 3.3528 3.5079 1.2881 2.4621 1.2882 2.0473 1.7366 2.1740 1.8220 2.2804 1.7269 1.2070 1.4140 1.2521 2.3131 1.9484 1.9369 1.6002 1.5618 1.6783 1.7887 2.0651 2.0978 2.1225 1.3999 1.9763 2.5809 2.8866 2.6542 2.5014 2.2128 2.4389 2.3590 2.3067 1.7604 1.7935 1.9403 1.8719 1.7088 1.8089 1.3377 1.3264 1.2747 1.7629 1.4612 1.3238 1.2527 1.6212 1.3241 1.4019 1.5166 1.3051 1.4392 1.3679 1.5139 1.3217 1.4638 1.6440 1.4639 1.2148 1.2133 1.2093 1.2118 1.2165 1.2099 1.1495 1.0838 1.0769 1.0480 1.0510 1.0493 1.0954 1.0561 1.0604 1.9429 1.0643 1.0751 1.0596 1.0553 1.0477 1.0500 1.8273 8.9435 4.6097 1.1051 8.8612 1.0828 1.0825 1.0647 1.0353 1.0356 1.0356 1.0693 1.0442 1.0365 1.0715 1.0468 1.0728 1.0617 1.0715 1.0823 1.0965 1.1025 1.1002 1.0995 1.0997 1.0998 1.0999 1.0996 1.0996 1.0986 1.0983 1.0986 1.0988 1.0989 1.0996 1.0839 1.0767 1.0466 1.0638 1.0971
irintensity: 0.1184 0.3805 0.5936 0.1424 0.5309 0.6555 1.8354 2.5699 1.4584 3.5638 0.2978 1.2612 1.4183 0.1556 2.7637 3.2985 3.1238 5.5341 2.4382 1.3809 1.1280 0.2063 0.9809 11.2121 2.4923 2.7859 1.3527 1.0224 14.6541 14.0764 1.3964 2.3693 9.2077 6.6081 3.9850 4.9424 0.4480 2.7709 1.9732 1.2188 2.5625 1.4080 18.3027 9.5895 9.8002 35.9582 21.4941 9.0223 73.6999 93.5646 124.2426 12.6798 60.1866 54.3367 6.4896 110.7356 7.4976 63.5648 46.6819 6.1133 5.7336 12.9565 2.6806 0.2432 4.0455 5.1909 5.1638 7.6586 18.4766 6.4765 2.1826 0.6915 2.8699 5.9631 4.4658 10.0436 8.5557 18.6309 162.5021 10.3917 0.7723 5.5257 0.8384 8.9235 8.1314 6.7945 35.6133 11.2242 10.7330 7.6737 6.9764 4.2300 12.2124 4.7268 11.7095 4.5426 15.6022 14.9292 8.3242 1.8558 29.6698 3.5112 7.1247 5.2656 3.0784 7.7633 5.0437 2.1835 11.7873 6.3134 2.7797 2.3774 22.1086 15.2403 16.5554 14.0301 16.5305 22.8952 45.8301 8.4979 2.6694 4.1040 6.1639 3.3303 30.0289 7.8982 10.1044 199.7014 20.3052 9.3356 8.6260 16.6544 25.9850 28.3492 396.3973 89.9391 265.6553 41.0106 232.7957 27.0259 29.6489 20.0135 38.3244 38.9794 46.2539 37.5270 28.0123 15.2081 6.3787 24.9693 9.2948 30.4570 13.7885 17.7035 10.8530 5.1733 8.2628 8.1761 43.5778 19.7022 12.0431 39.0907 22.1760 53.5551 71.4819 80.6133 74.6072 96.3990 52.2515 249.4392 130.3276 0.5610 25.0581 6.9836
temp: 298.150 k
press: 1.00000 atm
elementType: 8 8 8 8 7 7 7 6 6 6 6 6 6 6 6 6 6 6 6 6 6 6 6 6 6 1 1 1 1 1 1 1 1 1 1 1 1 1 1 1 1 1 1 1 1 1 1 1 1 1 1 1 1 1 1 1 1 1 1 1
symmnumber: 1
zpe: 1361486.4 jmol-1
zpe.correction: 0.518563 hartree
zpe.thermalcorrener: 0.548797 hartree
zpe.thermalcorrenthalpy: 0.549741 hartree
zpe.thermalcorrgfe: 0.453418 hartree
zpe.sumelectzpe: -1170.095923 hartree
zpe.sumelectthermal: -1170.065689 hartree
zpe.sumelectthermalent: -1170.064745 hartree
zpe.sumelectthermalfe: -1170.161068 hartree
dipole: 6.7677 -1.3179 -0.3955
dipole: 6.9062
quadrupole: -156.6146 -154.9970 -151.7228
quadrupole: 0.6022 -12.6751 9.0574
quadrupole: -2.1698 -0.5522 2.7220 0.6022 -12.6751 9.0574
hfenergy: -1170.6144859 hartree
pointgroup: C01 [X(C18H35N3O4)]
dipole: 2.7157414 0.0512886 0.0686443 debye
polarizability: 243.8510642|-1.2637106|251.5553333|-0.8343764|-5.9048916|196.8083554 unknown
InChI: InChI=1S/C18H35N3O4/c1-10(2)7-13(19)16(22)20-14(8-11(3)4)17(23)21-15(18(24)25)9-12(5)6/h10-15,20-21,24H,7-9,19H2,1-6H3
charge 0 multiplicity 1
60 atoms
O  -2.451676 -2.005764 1.368421
O  0.489591 0.463196 -1.207959
O  -3.828955 0.110459 -2.034542
O  -5.252052 1.444894 -0.783258
N  0.763399 -1.271475 0.334477
N  -2.037152 -0.210772 -0.067044
N  3.068432 -0.397769 1.308452
C  -0.417398 -2.060675 -0.070866
C  -0.275536 -3.526531 0.376903
C  0.945836 -4.280571 -0.211798
C  -3.245664 0.517195 0.314167
C  -2.964074 1.832804 1.102859
C  2.456532 0.501443 0.294897
C  3.409425 0.869731 -0.872929
C  -1.731499 -1.433212 0.491857
C  -1.921816 2.800256 0.481375
C  4.622412 1.747781 -0.468632
C  1.14885 -0.11138 -0.268777
C  1.021234 -5.701001 0.397451
C  0.900752 -4.352201 -1.757186
C  -1.69221 3.98674 1.449304
C  -2.324543 3.315215 -0.921725
C  4.189028 3.157312 0.001792
C  5.611874 1.855437 -1.653764
C  -4.206366 0.761969 -0.853972
H  -0.48188 -1.992046 -1.17503
H  -0.244469 -3.556275 1.483757
H  -1.204468 -4.056185 0.093104
H  1.871432 -3.737579 0.077117
H  -3.793289 -0.16283 1.001543
H  -3.929822 2.359041 1.231584
H  -2.612478 1.536246 2.109955
H  2.142498 1.436427 0.800076
H  3.774737 -0.074438 -1.331373
H  2.81375 1.384786 -1.649771
H  -0.961507 2.254132 0.37652
H  1.391155 -1.564268 1.102841
H  5.14997 1.249203 0.373788
H  -1.372314 0.1821 -0.756764
H  1.90523 -6.249902 0.023201
H  0.121506 -6.288701 0.131487
H  1.083243 -5.663487 1.501248
H  0.942152 -3.35045 -2.222965
H  1.754967 -4.935877 -2.147977
H  -0.029574 -4.847474 -2.096774
H  -2.620145 4.577972 1.572646
H  -1.379918 3.636789 2.451658
H  -0.909072 4.666361 1.064714
H  -3.317023 3.803232 -0.895751
H  -1.586354 4.053639 -1.285574
H  -2.361943 2.50183 -1.669449
H  3.636849 3.681553 -0.801419
H  5.070648 3.770936 0.263516
H  3.534726 3.122503 0.89244
H  5.126204 2.336197 -2.524559
H  6.495186 2.463012 -1.38276
H  5.969291 0.8591 -1.975272
H  3.874699 -0.923684 0.953791
H  3.276286 0.04794 2.205773
H  -4.518897 0.293214 -2.729628
