program: Gaussian 09
title: 000259248
version: EM64L-G09RevD.01
frameworkgroup: C1[X(C15H8Cl3NO2)]
method: RPBEPBE
basis: SDD
operation: Freq
keyword: #p
keyword: freq=noraman
keyword: PBEPBE/SDD
title: #p freq=noraman PBEPBE/SDD
converged: YES YES NO NO
title: Mulliken charges:
elementType: Cl Cl Cl O O N C C C C C C C C C C C C C C C H H H H H H H H
charge: 0.006327 0.001673 -0.038526 -0.133850 -0.236897 -0.453291 0.482171 0.249677 0.336532 0.208559 -0.318884 -0.604871 -0.338822 0.728241 -0.382451 -0.516793 -0.390915 -0.200453 -0.109186 0.224193 -0.795922 0.361422 0.275653 0.304159 0.260688 0.322288 0.242991 0.273254 0.243033
chargesum: 0.00000
title: Mulliken charges with hydrogens summed into heavy atoms:
elementType: Cl Cl Cl O O N C C C C C C C C C C C C C C C
charge: 0.006327 0.001673 -0.038526 -0.133850 -0.236897 -0.131002 0.482171 0.249677 0.336532 0.208559 -0.318884 -0.243449 -0.338822 0.728241 -0.106799 -0.516793 -0.086756 0.060235 -0.109186 0.224193 -0.036645
polarizability: 3.91383690e+02 -3.61880114e+00 2.34804146e+02 4.88137831e-04 1.53787797e-03 7.79894186e+01
1716.lowfreq: -75.2622 0.0007 0.0014 0.0018 1.0584 1.4358 5.0030 32.4227 49.4448
frequency: -75.2578 32.4126 49.4230 64.8493 75.9779 87.1885 99.1144 134.6093 146.9735 172.6965 195.9096 211.5103 230.7815 249.9260 251.1866 291.3200 291.5792 311.4003 340.1594 387.3833 398.0112 430.0832 489.4663 491.3307 491.6463 540.1965 544.0117 576.9577 596.2136 622.0404 644.7301 670.7640 690.4766 697.8146 719.8221 765.6081 776.8870 806.6992 822.2017 840.7840 875.5467 922.0847 943.5422 965.2115 973.8506 975.8713 1012.2871 1033.6453 1038.9421 1058.4728 1099.7551 1139.6579 1182.2966 1192.6188 1223.8233 1260.6392 1291.7084 1327.6441 1356.7389 1379.1305 1407.2445 1427.3711 1433.2801 1447.8487 1466.3640 1469.2647 1498.7163 1563.6704 1586.3429 1597.5798 1617.0274 1638.0488 1645.8197 2990.8570 3076.2025 3139.0694 3165.6194 3169.6096 3184.3468 3189.2757 3486.2282
redmass: 1.0353 8.2783 11.6667 5.6769 8.3269 8.1140 7.7575 9.5293 6.2226 6.4865 16.4262 23.4057 8.5584 5.3491 10.6768 8.3208 8.6206 9.0724 7.2854 4.9445 10.3513 4.3802 6.0516 4.7567 6.4087 5.6332 6.0622 3.1401 7.4259 4.1850 8.7473 7.5607 1.4336 7.1199 3.7397 6.1676 5.1169 8.8938 3.5299 1.5098 6.5431 1.5118 6.9930 1.3836 2.0791 1.5370 6.5191 1.6703 3.3691 1.9493 3.1077 1.9088 2.7050 2.3414 3.3342 1.4018 3.7606 4.2158 7.2341 1.2372 3.7312 5.1299 2.6999 1.2353 1.0462 5.8971 2.1514 5.8874 8.4104 8.1850 8.3637 8.2360 6.3900 1.0384 1.0983 1.0982 1.0901 1.0937 1.0939 1.0958 1.0763
irintensity: 0.1739 0.7013 2.7339 8.5348 0.4943 1.2044 0.7144 3.7107 0.5052 0.3963 0.9534 0.9614 1.2586 2.0845 5.6565 0.0897 1.8221 1.3994 0.5481 0.4292 32.3155 2.1808 12.1363 11.2617 5.5860 9.6355 0.9483 0.0131 16.9521 0.0634 11.6830 4.7969 59.3369 6.2095 22.6852 48.7126 0.5456 25.9497 28.6735 23.9090 15.2845 4.6925 5.0553 0.0316 70.0510 34.6842 12.7771 8.6403 14.9007 7.0554 72.2145 24.8507 149.8250 14.2180 139.6895 0.0065 88.6567 198.9752 3.5433 70.7262 51.9276 28.4771 213.3950 145.8711 21.1538 98.8878 397.4981 105.8634 32.2533 112.3505 94.0896 4.9743 168.5579 4.8961 11.5501 6.1487 1.6746 1.0448 21.2345 2.1009 41.1170
temp: 298.150 k
press: 1.00000 atm
elementType: 17 17 17 8 8 7 6 6 6 6 6 6 6 6 6 6 6 6 6 6 6 1 1 1 1 1 1 1 1
symmnumber: 1
zpe: 500597.7 jmol-1
zpe.correction: 0.190668 hartree
zpe.thermalcorrener: 0.208534 hartree
zpe.thermalcorrenthalpy: 0.209478 hartree
zpe.thermalcorrgfe: 0.143275 hartree
zpe.sumelectzpe: -2160.361029 hartree
zpe.sumelectthermal: -2160.343163 hartree
zpe.sumelectthermalent: -2160.342219 hartree
zpe.sumelectthermalfe: -2160.408422 hartree
dipole: 3.5055 4.3758 0.0002
dipole: 5.6068
quadrupole: -117.1410 -157.6904 -142.2693
quadrupole: -1.2432 0.0035 0.0004
quadrupole: 21.8925 -18.6568 -3.2357 -1.2432 0.0035 0.0004
hfenergy: -2160.5516969 hartree
pointgroup: C01 [X(C15H8Cl3N1O2)]
dipole: -1.2351985 1.827645 0.0018919 debye
polarizability: 390.9406206|-9.0705613|235.2470213|0.011101|0.174063|77.9896127 unknown
InChI: InChI=1S/C15H8Cl3NO2/c1-6(20)19-11-5-10-12(14(18)13(11)17)8-3-2-7(16)4-9(8)15(10)21/h2-5,19H,1H3
charge 0 multiplicity 1
29 atoms
Cl 0.187993 3.451448 0.003696
Cl -2.982314 2.960965 0.00274
Cl 6.305779 -0.912527 -0.001136
O  0.839939 -2.924337 -0.003492
O  -4.082165 -2.247095 -0.002976
N  -3.821865 0.0903 -0.000522
C  0.423589 0.656623 0.000728
C  -0.154418 -0.651401 -0.00077
C  1.905566 0.525926 0.000663
C  2.225531 -0.867192 -0.00089
C  0.956574 -1.671243 -0.001581
C  -1.528132 -0.894389 -0.001251
C  -0.451489 1.753311 0.001811
C  -2.417157 0.222369 -0.000157
C  2.94746 1.473735 0.001683
C  -1.851687 1.533605 0.001375
C  3.545685 -1.337504 -0.001501
C  4.291766 1.016736 0.001118
C  4.570717 -0.365679 -0.000455
C  -4.587054 -1.091385 -0.001895
C  -6.091289 -0.835357 -0.001863
H  -1.931238 -1.909094 -0.002373
H  2.744665 2.546468 0.002857
H  3.761232 -2.409704 -0.002692
H  5.115562 1.736399 0.001879
H  -4.34332 0.972985 0.000357
H  -6.400842 -0.264977 0.89329
H  -6.611539 -1.803437 -0.002385
H  -6.400653 -0.264149 -0.896557
