program: Gaussian 09
title: 000259240
version: EM64L-G09RevD.01
frameworkgroup: C1[X(C14H10BrNO2)]
method: RPBEPBE
basis: SDD
operation: Freq
keyword: #p
keyword: freq=noraman
keyword: PBEPBE/SDD
title: #p freq=noraman PBEPBE/SDD
converged: YES YES NO NO
title: Mulliken charges:
elementType: Br O O N C C C C C C C C C C C C C C H H H H H H H H H H
charge: 0.016712 -0.426088 -0.243236 -0.412684 -0.325744 0.249551 0.195081 0.198026 0.180815 -0.540161 -0.379759 -0.397812 -0.385528 0.683548 -0.530814 -0.230201 -0.229609 -0.066775 0.257536 0.339753 0.261708 0.261958 0.240512 0.231092 0.229642 0.340717 0.305394 0.176365
chargesum: 0.00000
title: Mulliken charges with hydrogens summed into heavy atoms:
elementType: Br O O N C C C C C C C C C C C C C C
charge: 0.016712 -0.085371 -0.243236 -0.107290 -0.068208 0.249551 0.195081 0.198026 0.180815 -0.200409 -0.118051 -0.135854 -0.145016 0.683548 -0.530814 0.000892 0.000033 0.109590
polarizability: 3.08106879e+02 1.92676658e+01 2.10223631e+02 1.23280656e+00 -3.49334561e+00 7.44934954e+01
1716.lowfreq: -5.6011 0.0003 0.0005 0.0006 1.9899 6.1084 40.4894 67.0668 80.4713
frequency: 40.4764 67.0663 80.4713 108.8292 115.9021 136.7744 159.2382 197.8871 205.6318 216.5357 247.7658 305.8920 342.1749 360.2962 383.8622 409.8690 417.0558 450.2913 470.0455 526.0172 554.6989 575.4982 613.5295 630.6717 672.6444 691.4147 710.2793 726.2416 747.9409 769.8828 790.5284 821.9108 827.3986 879.3209 885.0841 932.1281 945.2002 954.0389 959.5190 977.0518 990.4875 1000.0355 1025.7508 1099.4754 1102.3996 1154.2546 1168.9068 1179.8740 1198.5516 1205.5020 1208.3172 1240.7190 1282.5297 1305.9046 1344.5262 1354.9327 1380.5346 1388.2979 1428.5832 1439.6327 1451.4911 1481.6670 1498.3060 1580.4484 1594.8349 1616.3350 1620.6702 1637.6020 2943.2271 3025.1725 3126.1588 3136.0369 3148.5693 3161.1701 3164.8531 3178.5450 3463.7499 3548.4356
redmass: 7.4913 6.7330 5.2760 6.9969 4.7374 9.6451 4.1681 5.6004 5.4870 6.1231 7.5471 3.9982 2.2173 2.0043 3.4567 5.9057 4.4509 3.3864 3.9799 5.0629 4.9161 6.7587 5.3073 4.7839 3.9792 1.9000 3.0699 3.6831 1.8993 2.8121 2.9401 6.1914 3.8471 1.3815 1.5825 3.2693 1.7092 1.4213 1.4856 5.6353 1.3290 6.1620 2.1874 1.9806 2.1974 3.1805 1.2232 1.6230 1.6333 1.3045 2.4604 1.2935 1.8019 2.4281 3.8106 1.1759 2.1187 2.2012 4.9139 2.4357 2.7549 4.1973 2.3896 6.4697 6.7267 7.5089 7.5740 4.7265 1.0868 1.0833 1.0860 1.0895 1.0948 1.0929 1.1003 1.0935 1.0769 1.0663
irintensity: 0.0915 0.2647 13.5984 1.0948 1.9304 5.5108 1.4921 2.8407 2.6282 1.4887 2.1438 13.1295 70.3208 43.9464 6.4045 1.1033 15.2914 4.2324 12.3248 0.9006 0.6510 22.2263 5.8474 9.0051 9.7686 27.5525 39.9214 36.9862 27.8221 52.3431 15.5035 28.6368 7.4431 12.0902 1.0459 23.0207 1.1601 1.1869 14.4107 101.9378 0.0022 10.8374 9.1730 3.1568 20.5872 26.7484 9.2805 7.0885 3.2593 24.0745 4.9951 7.0875 6.4793 27.0753 51.7018 40.6292 0.8356 59.0953 46.7369 51.0091 30.5907 7.6069 438.8490 78.3706 2.9012 40.6624 17.1355 191.5920 125.8260 7.1768 2.6939 3.9565 19.8461 1.0958 36.4194 10.6318 55.1199 9.5536
temp: 298.150 k
press: 1.00000 atm
elementType: 35 8 8 7 6 6 6 6 6 6 6 6 6 6 6 6 6 6 1 1 1 1 1 1 1 1 1 1
symmnumber: 1
zpe: 537024.9 jmol-1
zpe.correction: 0.204542 hartree
zpe.thermalcorrener: 0.219659 hartree
zpe.thermalcorrenthalpy: 0.220603 hartree
zpe.thermalcorrgfe: 0.161095 hartree
zpe.sumelectzpe: -756.919082 hartree
zpe.sumelectthermal: -756.903965 hartree
zpe.sumelectthermalent: -756.903021 hartree
zpe.sumelectthermalfe: -756.962529 hartree
dipole: -0.0265 -3.9875 0.5213
dipole: 4.0215
quadrupole: -91.4061 -127.4115 -114.1751
quadrupole: 1.6825 -0.0031 0.0532
quadrupole: 19.5915 -16.4139 -3.1775 1.6825 -0.0031 0.0532
hfenergy: -757.1236238 hartree
pointgroup: C01 [X(C14H10Br1N1O2)]
dipole: -0.4430766 1.4910406 -0.2895292 debye
polarizability: 310.8748798|9.5695329|206.6068912|-1.0723962|-11.2146003|75.3422341 unknown
InChI: InChI=1S/C14H10BrNO2/c15-12-5-10-8-3-1-2-4-9(8)14(18)11(10)6-13(12)16-7-17/h1-7,14,16,18H
charge 0 multiplicity 1
28 atoms
Br 2.994268 3.16897 -0.26211
O  -0.851006 -2.819738 -0.591554
O  4.178765 -2.167466 0.298248
N  3.832785 0.160995 0.033602
C  -0.938031 -1.681042 0.339557
C  0.171893 -0.635559 0.18848
C  -2.206934 -0.834391 0.202946
C  -0.397504 0.663846 0.054779
C  -1.87109 0.545367 0.062409
C  1.554819 -0.840515 0.186316
C  0.440945 1.789498 -0.075248
C  -3.546303 -1.252932 0.21124
C  -2.883484 1.520158 -0.058295
C  2.421849 0.286979 0.047781
C  1.832912 1.581669 -0.076258
C  -4.565859 -0.274418 0.080351
C  -4.234953 1.097593 -0.047743
C  4.605198 -0.991445 0.15367
H  -0.886965 -2.174875 1.327515
H  1.994615 -1.83573 0.281344
H  0.036658 2.800597 -0.174642
H  -3.796729 -2.314665 0.309478
H  -2.639453 2.583479 -0.161268
H  -5.617972 -0.579893 0.080584
H  -5.035745 1.839431 -0.142442
H  -0.880813 -2.470123 -1.51933
H  4.349833 1.041083 -0.075401
H  5.690702 -0.747571 0.105492
