program: Gaussian 09
title: 000259237
version: EM64L-G09RevD.01
frameworkgroup: C1[X(C13H9Cl2NO)]
method: RPBEPBE
basis: SDD
operation: Freq
keyword: #p
keyword: freq=noraman
keyword: PBEPBE/SDD
title: #p freq=noraman PBEPBE/SDD
converged: NO YES NO NO
title: Mulliken charges:
elementType: Cl Cl O N C C C C C C C C C C C C C H H H H H H H H H
charge: -0.071575 -0.063778 -0.431612 -0.689920 -0.331693 0.243335 0.198493 0.219540 0.196165 -0.610166 -0.420091 -0.382252 -0.379524 0.672610 -0.370321 -0.100169 -0.217461 0.254682 0.257286 0.262922 0.282985 0.245366 0.255156 0.341636 0.321831 0.316555
chargesum: 0.00000
title: Mulliken charges with hydrogens summed into heavy atoms:
elementType: Cl Cl O N C C C C C C C C C C C C C
charge: -0.071575 -0.063778 -0.089976 -0.051534 -0.077012 0.243335 0.198493 0.219540 0.196165 -0.352880 -0.157170 -0.099267 -0.134158 0.672610 -0.370321 -0.100169 0.037695
polarizability: 3.20456488e+02 1.02934154e+01 1.70904137e+02 -8.61474222e-02 -5.47303567e+00 7.17385165e+01
1716.lowfreq: -0.0026 0.0011 0.0015 1.2624 3.5365 4.2583 45.8446 70.6477 105.7712
frequency: 45.8442 70.6475 105.7709 120.5873 132.5235 177.6780 209.9624 237.9114 258.2204 264.1956 301.6403 322.5114 363.0218 376.0474 393.8953 411.8999 426.0164 446.0919 453.9390 473.2718 491.1405 545.2182 567.6196 616.9269 628.3834 649.7658 692.5123 719.1487 731.7164 755.1235 783.0686 825.8993 851.6640 872.9211 881.2735 899.4824 950.4409 951.7149 980.7799 1003.2821 1049.0851 1060.7002 1116.3290 1142.5549 1172.9756 1197.2447 1204.6140 1218.5631 1248.8345 1269.0993 1329.0148 1355.2428 1368.6509 1378.1329 1419.6866 1451.0243 1461.7382 1492.4212 1579.1501 1585.9589 1608.7987 1623.6173 1644.6543 3025.7267 3135.2988 3140.0784 3160.1102 3165.3371 3172.7873 3546.5469 3551.9385 3699.5337
redmass: 8.5275 7.4184 9.2983 5.3161 6.1474 6.0171 7.8185 5.0053 6.2902 7.7106 5.0684 6.9667 1.5391 2.4463 1.6156 2.2716 3.5178 5.2463 2.3675 1.3902 4.6377 5.1522 4.0298 6.2924 5.8341 7.6457 6.0877 4.8499 5.0128 4.0551 3.7827 1.4417 4.3501 1.6143 1.5120 1.5063 1.3705 4.0568 3.8745 5.3163 1.6430 1.9221 1.9295 2.3985 2.0457 1.5267 1.2653 2.1297 1.3404 1.4222 4.4047 1.1858 8.3293 3.4555 4.0106 3.2669 6.9105 5.1131 8.4113 7.9111 7.6391 1.5771 2.9516 1.0834 1.0920 1.0899 1.0927 1.0930 1.0957 1.0662 1.0455 1.1036
irintensity: 0.3434 1.7828 0.3252 0.6175 1.0762 0.5778 0.2235 0.4061 2.5402 3.0633 10.3939 1.1621 67.1440 29.6042 83.6494 25.3287 44.9935 22.6143 120.7593 70.2182 1.9891 2.3580 7.4692 3.8326 6.7382 5.5098 21.0742 7.0062 23.7993 15.8713 40.1507 39.3864 34.6072 2.7772 24.5678 11.7219 0.1022 15.8375 85.5347 15.9960 34.1070 16.9533 16.5406 12.4009 40.7249 1.8751 29.4330 2.5250 19.6013 4.0271 40.6309 32.9847 11.1534 24.0715 54.2172 67.4299 181.3508 52.8779 14.0975 3.6117 11.0296 24.8967 360.0365 8.6943 10.4783 7.9619 0.9454 0.5108 5.6996 9.3748 147.7979 36.3003
temp: 298.150 k
press: 1.00000 atm
elementType: 17 17 8 7 6 6 6 6 6 6 6 6 6 6 6 6 6 1 1 1 1 1 1 1 1 1
symmnumber: 1
zpe: 487868.3 jmol-1
zpe.correction: 0.185819 hartree
zpe.thermalcorrener: 0.200406 hartree
zpe.thermalcorrenthalpy: 0.201351 hartree
zpe.thermalcorrgfe: 0.144040 hartree
zpe.sumelectzpe: -1549.716106 hartree
zpe.sumelectthermal: -1549.701519 hartree
zpe.sumelectthermalent: -1549.700575 hartree
zpe.sumelectthermalfe: -1549.757885 hartree
dipole: 3.6976 0.5495 0.2431
dipole: 3.7461
quadrupole: -110.3880 -106.5878 -113.2431
quadrupole: 12.5265 -0.7420 -1.2488
quadrupole: -0.3150 3.4851 -3.1701 12.5265 -0.7420 -1.2488
hfenergy: -1549.9019253 hartree
pointgroup: C01 [X(C13H9Cl2N1O1)]
dipole: 1.4664336 -0.1191262 -0.0868823 debye
dipolederiv: -0.6076439 -0.3156286 0.0455612 -0.4145866 -0.415701 0.0487493 0.0699654 0.0547905 -0.0773505 -1.0781414 -0.027273 -0.0079816 -0.0912553 -0.1315047 0.0064627 -0.0185783 0.0054037 -0.0752432 -0.5954607 -0.0085989 -0.0263021 -0.0186048 -0.637618 -0.2406419 -0.0405326 -0.3511522 -0.3231692 -1.8256539 0.4181592 -0.053838 0.550853 -0.272898 -0.0637823 -0.043627 -0.0688586 -0.6857605 0.4692223 0.0242532 0.0121623 -0.0090793 0.5448007 0.1614019 0.0357708 0.2560222 0.4413213 0.0190645 -0.2119935 0.0031505 0.0049442 0.1018305 -0.0720102 -0.0279326 -0.0572459 -0.0860838 -0.319932 0.0337821 0.0114243 -0.1786574 -0.0148004 -0.0662408 0.0319293 -0.0472244 -0.1059312 -0.3261123 0.0883779 -0.0171028 -0.0448439 -0.1968393 0.0147074 0.0267383 0.0089565 -0.0334369 0.7513426 -0.1670973 0.0312491 -0.0193376 -0.096734 0.0068429 -0.0111076 0.0051261 0.0147352 -0.4051974 0.2617281 -0.0359075 -0.3560864 0.0874229 -0.0431361 0.0686678 -0.0401466 -0.1949646 0.2653543 -0.000191 -0.0093238 -0.127344 -0.0418115 -0.0060668 0.0033496 0.0038091 -0.0714638 -0.1609581 0.0319958 -0.0108824 0.0498615 0.0097218 -0.0203862 -0.023324 -0.0079243 -0.0962349 -0.1365509 0.0707648 -0.0012268 0.1219887 0.0648749 -0.0347826 -0.0090605 -0.0236119 -0.1454583 1.5373316 -0.6122911 0.0677264 -0.8215607 0.035175 0.0267323 0.0747634 0.0393909 0.1431053 0.287261 0.4692684 -0.0706458 1.3317877 0.4260455 -0.0899991 -0.1920297 -0.0900144 -0.11146 1.3017563 0.0581893 0.0179312 0.2694713 0.0986636 -0.0222604 0.0102992 -0.0184407 -0.0786844 -0.3155799 -0.0621938 0.0074772 -0.194642 -0.0141081 -0.0198084 0.0206547 -0.0171845 -0.1018781 -0.0009922 -0.004647 0.0078798 -0.0097261 -0.0189664 0.0688132 -0.0000586 0.0195382 -0.0421216 0.0350989 0.0342385 -0.0006267 0.0624519 -0.0543764 0.033615 -0.002836 0.0292737 0.1614185 0.112066 0.04111 -0.00514 0.0209928 -0.0247454 0.0237725 -0.0002612 0.0251524 0.1525891 0.0804637 -0.0332794 0.0017838 -0.0631733 0.0162631 0.0230781 0.0067135 0.020237 0.1562884 0.0406174 -0.0887558 0.0102733 -0.0555494 -0.0503341 0.0261256 0.0052998 0.0286753 0.1496145 0.0187389 0.0757712 -0.0135889 0.0783982 0.013011 0.0229132 -0.0173982 0.0240983 0.1606667 0.3277636 -0.0068537 0.0186862 -0.0040601 0.2324026 0.1588237 0.0199853 0.1443918 0.0999182 0.2955612 -0.0206706 0.0061033 0.0363575 0.1846787 0.0259476 -0.006247 0.0252331 0.3726223 0.2305805 -0.0481648 0.0111577 -0.1186001 0.1555471 0.0311294 0.0188562 0.0317048 0.3769615 unknown
polarizability: 321.1594983|0.2984158|169.2344658|0.7935956|-11.1270678|72.7051779 unknown
InChI: InChI=1S/C13H9Cl2NO/c14-6-1-2-7-8-4-11(15)12(16)5-10(8)13(17)9(7)3-6/h1-5,13,17H,16H2
charge 0 multiplicity 1
26 atoms
Cl 4.31051 2.13333 -0.240937
Cl -5.485295 0.094952 -0.012305
O  -0.487132 -2.918208 -0.479674
N  4.61593 -0.860888 0.158028
C  -0.387634 -1.748488 0.413149
C  0.896489 -0.92888 0.255417
C  -1.477263 -0.690514 0.212525
C  0.578836 0.448697 0.063129
C  -0.8889 0.598903 0.035733
C  2.216874 -1.381991 0.290755
C  1.61842 1.390903 -0.084786
C  -2.868299 -0.870216 0.203104
C  -1.710984 1.731974 -0.14289
C  3.291873 -0.449353 0.133473
C  2.942063 0.923736 -0.045917
C  -3.667084 0.280235 0.013739
C  -3.117667 1.568314 -0.153844
H  -0.453713 -2.20661 1.417249
H  2.439634 -2.446003 0.429788
H  1.420555 2.457065 -0.228975
H  -3.317577 -1.859279 0.330367
H  -1.28394 2.731692 -0.275592
H  -3.778106 2.428874 -0.293441
H  -0.449239 -2.598524 -1.418017
H  5.363816 -0.17933 0.052097
H  4.851231 -1.840292 0.285226
