program: Gaussian 09
title: 000259241
version: EM64L-G09RevD.01
frameworkgroup: C1[X(C14H8Cl2N2O3)]
method: RPBEPBE
basis: SDD
operation: Freq
keyword: #p
keyword: freq=noraman
keyword: PBEPBE/SDD
title: #p freq=noraman PBEPBE/SDD
converged: YES YES NO NO
title: Mulliken charges:
elementType: Cl Cl O O O N N C C C C C C C C C C C C C C H H H H H H H H
charge: 0.018264 -0.028646 -0.207498 -0.207318 -0.211474 -0.436326 0.016796 -0.686849 0.402498 0.329503 0.277559 0.165623 -0.564056 -0.463376 -0.582680 -0.337146 0.747087 -0.368719 0.415927 -0.391410 -0.047873 0.272345 0.277086 0.273304 0.302087 0.251232 0.289844 0.318324 0.175889
chargesum: 0.00000
title: Mulliken charges with hydrogens summed into heavy atoms:
elementType: Cl Cl O O O N N C C C C C C C C C C C C C C
charge: 0.018264 -0.028646 -0.207498 -0.207318 -0.211474 -0.118002 0.016796 -0.137418 0.402498 0.329503 0.277559 0.165623 -0.564056 -0.190072 -0.280593 -0.085913 0.747087 -0.368719 0.415927 -0.101566 0.128016
polarizability: 3.88946283e+02 -1.15803380e+00 2.14077119e+02 3.08415869e+00 -5.25192302e-02 8.68145417e+01
1716.lowfreq: -5.4850 -3.0556 -0.0026 -0.0020 -0.0005 2.3381 35.7374 49.4811 64.3473
frequency: 35.7313 49.4808 64.3467 69.6418 93.2281 95.3596 128.9883 149.8694 176.0619 196.1715 207.0740 211.2338 248.3880 282.1216 286.7283 322.8976 339.3402 357.3615 388.7138 431.5295 439.2042 465.3871 507.9233 526.0952 532.5398 556.3515 590.8286 595.3430 624.9288 648.8547 684.7239 704.2285 718.8653 726.5805 761.2823 764.6529 803.1766 841.6706 853.0692 880.3701 898.4092 907.4366 949.2905 969.1397 970.3822 991.0592 1035.3055 1073.6887 1110.8852 1123.8115 1135.4885 1173.3124 1184.3777 1200.9368 1219.3790 1220.4629 1272.0199 1317.1515 1342.1664 1361.5769 1376.5593 1396.9599 1421.9312 1431.9686 1435.0306 1443.6540 1463.6267 1480.0918 1562.7206 1591.2150 1609.5596 1621.4790 1654.6686 2950.1951 2995.8565 3040.4186 3149.2454 3171.8431 3175.0027 3186.8398 3502.9936
redmass: 9.0024 13.0705 11.1490 9.4036 5.2327 10.3187 11.4363 7.9949 18.5926 5.4624 5.1174 3.3380 8.0057 9.6322 2.9097 6.3515 6.3603 12.4608 5.5597 4.8140 3.9011 7.0315 4.0095 4.7500 4.4516 1.4020 5.9243 5.0546 5.6044 6.9458 5.5138 5.3009 7.3754 6.1954 4.3732 5.6098 7.2927 6.6619 1.4318 1.6424 4.6377 1.6903 2.9852 1.9494 1.8314 1.3613 7.2299 2.0545 2.8626 1.7291 1.1476 2.6208 2.3908 2.6377 2.5893 2.9963 1.4424 3.5746 3.7763 9.3782 1.2947 5.4147 1.2546 3.3803 6.1473 3.0229 2.5548 3.6953 8.7496 8.1119 8.7536 7.7376 5.8543 1.0878 1.0616 1.0988 1.0909 1.0934 1.0930 1.0950 1.0769
irintensity: 1.3132 0.1963 2.1181 8.5990 0.3102 0.8028 5.5515 6.0775 0.4208 7.2438 13.0066 1.8646 1.5665 2.6042 9.2006 1.7384 2.3568 8.3580 1.1196 2.5373 7.6397 0.5803 0.1207 9.0585 0.5394 93.8046 8.6503 5.3182 8.4645 12.1668 25.7831 8.3321 51.4167 22.7169 8.2007 11.4406 27.4637 40.4659 43.8986 13.3180 3.9720 2.6737 3.7039 11.1723 21.7628 0.8518 14.9093 77.1658 73.4925 18.4844 0.2533 12.0878 4.3201 353.7520 14.8939 287.9522 22.8252 77.0825 39.6025 96.3469 6.8410 56.5640 17.7053 26.2767 89.2819 37.0324 310.2408 19.0043 36.1831 14.1526 15.6201 72.9088 214.0993 144.7180 1.0536 1.3546 5.7081 0.1074 2.0082 1.7854 36.0580
temp: 298.150 k
press: 1.00000 atm
elementType: 17 17 8 8 8 7 7 6 6 6 6 6 6 6 6 6 6 6 6 6 6 1 1 1 1 1 1 1 1
symmnumber: 1
zpe: 505293.5 jmol-1
zpe.correction: 0.192456 hartree
zpe.thermalcorrener: 0.210174 hartree
zpe.thermalcorrenthalpy: 0.211119 hartree
zpe.thermalcorrgfe: 0.145416 hartree
zpe.sumelectzpe: -1792.069982 hartree
zpe.sumelectthermal: -1792.052264 hartree
zpe.sumelectthermalent: -1792.051319 hartree
zpe.sumelectthermalfe: -1792.117022 hartree
dipole: -4.7615 2.7342 -2.7921
dipole: 6.1598
quadrupole: -166.4116 -130.3728 -138.4389
quadrupole: -3.3533 11.0387 3.9965
quadrupole: -21.3371 14.7016 6.6355 -3.3533 11.0387 3.9965
hfenergy: -1792.262438 hartree
pointgroup: C01 [X(C14H8Cl2N2O3)]
dipole: -1.8362409 -1.0074587 1.2191734 debye
polarizability: 388.5036041|1.1353787|213.552001|-11.8936974|-8.2448613|87.7823387 unknown
InChI: InChI=1S/C14H8Cl2N2O3/c15-12-5-10-9-2-1-8(18(20)21)3-7(9)4-11(10)13(16)14(12)17-6-19/h1-3,5-6,17H,4H2
charge 0 multiplicity 1
29 atoms
Cl -2.738663 2.67606 0.512494
Cl -3.834236 -2.813852 0.49076
O  6.07602 -0.73952 -0.29291
O  5.60755 1.493101 -0.269348
O  -4.835529 1.468809 -1.476193
N  -4.558121 0.124851 0.446731
N  5.24879 0.251641 -0.236598
C  0.330596 1.654678 0.123047
C  -0.838198 0.690544 0.210972
C  1.526561 0.717383 0.036885
C  -0.375296 -0.659845 0.189166
C  1.090528 -0.645416 0.076493
C  -2.207222 0.956262 0.330489
C  -1.278611 -1.73926 0.29165
C  2.887823 1.028421 -0.06612
C  2.022135 -1.706964 0.012122
C  -3.157703 -0.104128 0.376273
C  -2.645442 -1.435081 0.375468
C  3.802326 -0.051157 -0.128629
C  3.393767 -1.406139 -0.092095
C  -5.301899 0.871998 -0.479112
H  0.380947 2.323394 1.003751
H  0.248192 2.315406 -0.761278
H  -0.943605 -2.779487 0.294229
H  3.263803 2.054375 -0.099088
H  1.693057 -2.750619 0.040663
H  4.154004 -2.189388 -0.145727
H  -5.0921 -0.472126 1.086142
H  -6.382876 0.866757 -0.212834
