program: Gaussian 09
title: 000259236
version: EM64L-G09RevD.01
frameworkgroup: C1[X(C13H7Cl2NO)]
method: RPBEPBE
basis: SDD
operation: Freq
keyword: #p
keyword: freq=noraman
keyword: PBEPBE/SDD
title: #p freq=noraman PBEPBE/SDD
converged: YES YES NO YES
title: Mulliken charges:
elementType: Cl Cl O N C C C C C C C C C C C C C H H H H H H H
charge: -0.056306 -0.050662 -0.150240 -0.685191 0.322292 0.299196 0.247250 0.205656 -0.312630 -0.417640 -0.616021 -0.385193 -0.394464 0.669801 -0.372938 -0.200018 -0.103452 0.267283 0.277972 0.250978 0.300662 0.257764 0.324183 0.321717
chargesum: 0.00000
title: Mulliken charges with hydrogens summed into heavy atoms:
elementType: Cl Cl O N C C C C C C C C C C C C C
charge: -0.056306 -0.050662 -0.150240 -0.039291 0.322292 0.299196 0.247250 0.205656 -0.312630 -0.150357 -0.338049 -0.134215 -0.093801 0.669801 -0.372938 0.057746 -0.103452
polarizability: 3.35363028e+02 9.51522641e+00 1.81200488e+02 3.59334868e-02 1.40865894e-02 6.11456917e+01
1716.lowfreq: -2.4105 -0.0020 -0.0012 0.0006 2.7211 4.6684 48.5294 75.4195 107.9210
frequency: 48.5286 75.4154 107.9202 130.1379 153.1946 199.9025 210.6895 252.1439 262.7821 265.0593 310.1340 327.2381 376.2469 413.8231 423.1817 436.0328 439.1547 477.6135 490.3271 500.5943 543.9904 597.6955 612.7989 631.4542 669.1695 704.1551 729.5151 746.7104 756.6303 813.7969 833.8662 875.8604 886.6699 899.9089 928.6323 955.6296 987.2212 1005.8297 1048.5848 1055.7972 1092.8162 1127.9449 1170.8683 1207.3417 1245.0832 1260.4406 1315.3771 1361.3199 1373.0952 1421.9167 1442.3796 1468.3191 1492.3545 1579.6576 1590.4117 1598.3827 1622.4858 1634.2119 1647.4115 3140.1288 3142.5174 3161.2168 3167.6943 3172.5441 3549.0768 3695.4890
redmass: 9.6857 7.6556 12.5668 6.7620 6.3629 15.1337 4.8884 8.3649 6.6292 8.8405 6.9031 7.0915 4.1896 1.5362 2.0207 3.1748 7.8091 1.1891 4.8415 4.2315 5.9023 6.5556 5.1974 7.5612 8.3220 5.4503 6.6524 6.3958 3.2286 3.2434 1.4366 7.8167 1.5358 1.5119 1.8627 1.4029 3.1901 4.1539 1.8338 1.7111 3.6378 2.0115 2.6690 2.2104 1.2934 1.4483 4.3537 9.3635 3.2111 4.1902 2.8082 7.9998 5.1887 8.4044 8.0792 8.3103 2.2128 3.2145 3.3883 1.0924 1.0901 1.0928 1.0934 1.0957 1.0456 1.1037
irintensity: 0.2532 3.9749 0.3012 0.5106 1.6173 1.3592 0.2581 1.9479 1.4090 3.7018 4.3797 1.7175 5.0710 96.2772 4.8859 13.4969 27.9847 209.0623 0.5290 3.0423 5.3139 8.1038 2.6944 1.0071 7.1347 2.3522 5.1391 70.7119 0.0665 29.8688 36.1077 12.4482 6.4398 7.6855 31.8892 1.6554 46.3609 5.7585 19.1431 4.7594 64.6800 12.8432 97.4897 1.4699 6.5195 16.3821 51.6397 5.9585 23.0988 61.9889 99.8467 187.6995 130.5170 50.9115 15.3912 117.9101 62.3746 168.4381 206.0997 7.5638 6.3883 0.7934 0.3913 5.4880 161.0444 37.7119
temp: 298.150 k
press: 1.00000 atm
elementType: 17 17 8 7 6 6 6 6 6 6 6 6 6 6 6 6 6 1 1 1 1 1 1 1
symmnumber: 1
zpe: 429845.3 jmol-1
zpe.correction: 0.163719 hartree
zpe.thermalcorrener: 0.177586 hartree
zpe.thermalcorrenthalpy: 0.178530 hartree
zpe.thermalcorrgfe: 0.122629 hartree
zpe.sumelectzpe: -1548.549787 hartree
zpe.sumelectthermal: -1548.535920 hartree
zpe.sumelectthermalent: -1548.534976 hartree
zpe.sumelectthermalfe: -1548.590877 hartree
dipole: 4.1965 -1.5280 0.0001
dipole: 4.4661
quadrupole: -101.2122 -108.5145 -115.2661
quadrupole: 14.8505 0.0056 -0.0053
quadrupole: 7.1187 -0.1836 -6.9351 14.8505 0.0056 -0.0053
hfenergy: -1548.7135061 hartree
pointgroup: C01 [X(C13H7Cl2N1O1)]
dipole: -1.6113714 0.7005908 0.0000284 debye
dipolederiv: -0.6347485 0.3483219 0.0001306 0.4425319 -0.4193765 -0.0001093 0.0004551 -0.0003041 -0.0586213 -1.0798695 0.0177925 0.0000349 0.0746243 -0.1167592 0.0000035 -0.0000457 0.0000048 -0.0634424 -0.5404961 0.071961 0.0000046 0.1093179 -1.0721417 0.0002032 0.0000158 0.0002452 -0.2966106 -1.7919018 -0.4640206 -0.000001 -0.5530407 -0.2575329 0.0011751 0.002011 0.0015063 -0.6920976 -0.3158245 -0.1804197 0.0001389 -0.03984 -0.1231778 0.0000501 0.0001565 0.0001434 -0.0458783 0.7605527 0.2545165 -0.000101 0.1292257 0.0264002 -0.0000337 -0.0000596 -0.0000175 0.0006157 -0.5772932 0.4606325 -0.0000564 0.1937228 -0.0476836 0.0000061 -0.000007 -0.0000786 0.0456268 -0.6534666 -0.2728915 0.0001025 -0.1067062 -0.22438 0.0000691 0.0000811 0.0001285 0.0312407 1.3283759 -0.0854688 -0.0000779 -0.0142549 1.3035082 -0.0003462 -0.0001713 -0.0005214 0.1095073 0.0974571 0.1099626 0.0000304 0.1501708 -0.0149002 0.0000446 0.0002647 -0.0001836 -0.065537 -0.2322932 -0.3787493 0.0001066 0.3834543 0.14282 -0.0002906 0.0003992 0.0001239 -0.1704636 -0.3245858 -0.1856222 0.0000698 -0.1959441 0.0453498 0.000001 -0.000011 -0.0000171 -0.1483005 -0.1072903 0.0507744 -0.0000121 -0.1002769 0.0591302 -0.0000229 -0.0000047 -0.000026 -0.070009 1.5449776 0.6755678 -0.0006236 0.8105435 -0.0679628 -0.0006333 -0.0016502 -0.0009506 0.1474361 0.4374799 -0.539231 -0.0001536 -1.3000455 0.4362643 0.0004039 -0.0013302 0.000571 -0.1220887 -0.1817865 0.1118313 -0.000029 0.1296804 0.0050605 0.0000152 -0.000023 -0.0000072 -0.0831404 1.4073324 -0.0447453 -0.000026 -0.1673843 0.0249267 -0.0000135 0.0001114 -0.0000124 -0.0931332 0.1093781 -0.0376722 -0.0000041 -0.0187055 -0.0220406 -0.0000129 0.0000164 -0.0000506 0.1564447 0.0462169 -0.0204517 0.0000185 -0.0567556 -0.0230941 0.0001317 0.0000337 0.0002088 0.171648 0.0415568 0.0871942 -0.0000107 0.0500218 -0.0458064 0.0000189 -0.0000086 0.0000255 0.155278 0.0952807 0.0166334 0.0000061 0.0580962 0.037797 0.000019 -0.0000333 0.0000342 0.1660754 0.0268902 -0.0731541 0.000017 -0.0766377 0.0173086 0.0000145 0.000005 0.0000046 0.1617263 0.3069926 0.0225107 0.0001135 -0.0353429 0.1689716 -0.0002789 0.0003519 -0.0001489 0.3785207 0.2370652 0.0547278 0.0003218 0.133545 0.1673187 -0.0004143 -0.0005574 -0.0006784 0.385203 unknown
polarizability: 335.9480723|0.0731225|180.6154441|-0.0367247|-0.011872|61.1456917 unknown
InChI: InChI=1S/C13H7Cl2NO/c14-6-1-2-7-8-4-11(15)12(16)5-10(8)13(17)9(7)3-6/h1-5H,16H2
charge 0 multiplicity 1
24 atoms
Cl -4.314206 2.14569 0.000909
Cl 5.51161 0.163308 -0.000251
O  0.551212 -2.934189 0.000753
N  -4.585647 -0.878534 0.001327
C  -0.563832 0.497068 -0.00015
C  0.909733 0.659518 -0.000235
C  -0.869747 -0.897329 0.000154
C  1.506222 -0.639837 -0.000016
C  0.416848 -1.680405 0.000388
C  -1.613556 1.431551 -0.000136
C  -2.180171 -1.377965 0.000363
C  1.730525 1.801944 -0.000331
C  2.89584 -0.8264 -0.000122
C  -3.268917 -0.447534 -0.000177
C  -2.935073 0.941353 -0.00011
C  3.14079 1.634858 -0.000418
C  3.696513 0.337997 -0.000334
H  -1.43645 2.510991 0.000058
H  -2.373283 -2.456654 0.001231
H  1.309446 2.812631 -0.000384
H  3.331333 -1.829751 0.000052
H  3.801027 2.507146 -0.000502
H  -5.346416 -0.202605 0.003087
H  -4.805202 -1.870252 -0.000458
