program: Gaussian 09
title: 000259231
version: EM64L-G09RevD.01
frameworkgroup: C1[X(C11H12O5)]
method: RPBEPBE
basis: SDD
operation: Freq
keyword: #pfreq=noraman
keyword: PBEPBE/SDD
title: #p freq=noraman PBEPBE/SDD
converged: YES YES NO NO
title: Mulliken charges:
elementType: O O O O O C C C C C C C C C C C H H H H H H H H H H H H
charge: -0.248814 -0.278306 -0.258631 -0.218035 -0.242138 0.004973 0.270843 0.187766 0.104953 -0.409472 0.012790 -0.540231 0.265700 -0.532692 -0.518123 -0.534822 0.259476 0.255704 0.271630 0.230303 0.294560 0.217801 0.214186 0.253931 0.230042 0.225394 0.252268 0.228944
chargesum: 0.00000
title: Mulliken charges with hydrogens summed into heavy atoms:
elementType: O O O O O C C C C C C C C C C C
charge: -0.248814 -0.278306 -0.258631 -0.218035 -0.242138 0.004973 0.270843 0.187766 0.104953 0.105708 0.012790 -0.268601 0.265700 0.209971 0.180036 0.171784
polarizability: 2.04470090e+02 -5.52566099e+00 1.61445617e+02 -1.40841968e+00 -5.01750172e-01 7.60820645e+01
1716.lowfreq: -4.1783 -2.4419 -0.0007 -0.0006 0.0005 8.7090 59.6593 64.5139 82.4241
frequency: 59.6564 64.5000 82.4073 102.0141 109.8281 142.2724 159.4957 163.4171 180.3426 209.6052 215.3921 243.0099 248.0787 267.4418 296.0048 306.8270 346.7448 390.6542 441.4232 484.2403 502.0016 528.7786 541.0578 614.7259 633.2179 658.4292 687.7475 721.2056 774.5718 816.3859 837.9571 884.7143 921.0958 961.6047 966.9181 968.5929 1032.0958 1071.7818 1107.7135 1110.8264 1122.9275 1132.5519 1138.4974 1155.0151 1159.6793 1164.3466 1172.7890 1225.2597 1261.6238 1324.0688 1383.6661 1403.5168 1419.0582 1433.3544 1440.9679 1454.4764 1455.5715 1460.4902 1463.7153 1468.7602 1472.2612 1478.9282 1491.3500 1557.2094 1602.6896 1624.4326 2970.0541 2973.7632 2976.7474 3028.3576 3063.1843 3076.8648 3084.5905 3097.8518 3123.8355 3130.3756 3134.9628 3190.8963
redmass: 3.4689 3.9479 3.1413 2.5111 3.2549 2.4197 1.1614 1.8589 2.9583 2.7140 1.5783 4.9088 3.6922 3.1331 4.2001 6.3448 4.5433 8.3684 6.1342 5.9756 6.4745 5.1190 4.0569 3.9949 8.3034 5.5881 7.5211 6.2737 2.9836 3.5191 3.0794 7.6807 7.6100 4.9959 3.0329 5.4864 6.3885 8.6660 1.2439 1.2593 1.3330 2.6370 1.0955 1.4161 1.4406 1.8438 1.6230 7.7893 1.6494 3.0508 5.5880 2.1760 1.6645 1.1764 1.2891 1.2199 1.0739 1.8613 1.4111 1.0533 1.1302 1.0557 1.0651 8.0204 9.6044 9.6984 1.0325 1.0320 1.0307 1.0574 1.1043 1.1017 1.1057 1.1074 1.1032 1.1033 1.1003 1.0920
irintensity: 2.2711 3.4894 6.0132 1.7037 12.2377 0.3956 1.7078 4.8535 0.9073 5.4768 2.6720 4.8767 8.8310 4.3937 0.5032 4.5129 3.1148 4.6039 12.6116 4.8719 26.0683 1.6816 1.1568 5.0158 8.0836 28.7375 2.2071 11.3477 2.5159 28.0284 26.5942 7.9675 28.1185 3.6496 28.0576 54.7892 56.1674 126.6233 5.0453 0.2063 3.8850 141.4339 0.7875 13.9575 31.0965 93.9969 24.8292 204.9626 38.3159 72.1380 75.8537 119.7925 6.9007 9.5649 82.3592 46.0666 20.0158 72.1816 52.4593 15.3782 40.1261 9.3467 53.7916 104.0290 704.3209 71.3903 66.9010 82.9172 74.6535 16.3679 38.7873 29.7392 21.8618 5.7695 22.9720 12.2688 18.5839 1.1459
temp: 298.150 k
press: 1.00000 atm
elementType: 8 8 8 8 8 6 6 6 6 6 6 6 6 6 6 6 1 1 1 1 1 1 1 1 1 1 1 1
symmnumber: 1
zpe: 557301.1 jmol-1
zpe.correction: 0.212265 hartree
zpe.thermalcorrener: 0.228098 hartree
zpe.thermalcorrenthalpy: 0.229042 hartree
zpe.thermalcorrgfe: 0.169391 hartree
zpe.sumelectzpe: -801.230213 hartree
zpe.sumelectthermal: -801.214380 hartree
zpe.sumelectthermalent: -801.213436 hartree
zpe.sumelectthermalfe: -801.273087 hartree
dipole: 1.8552 -2.1138 0.0565
dipole: 2.8131
quadrupole: -91.2650 -83.0141 -91.7747
quadrupole: -4.8855 6.4244 0.7373
quadrupole: -2.5804 5.6705 -3.0901 -4.8855 6.4244 0.7373
hfenergy: -801.4424779 hartree
pointgroup: C01 [X(C11H12O5)]
dipole: -0.5701828 0.930261 -0.185426 debye
polarizability: 199.2078585|-10.1031979|162.399855|17.4584399|-14.0166584|80.3900577 unknown
InChI: InChI=1S/C11H12O5/c1-13-8-4-7-9(6(12)5-16-7)11(15-3)10(8)14-2/h4H,5H2,1-3H3
charge 0 multiplicity 1
28 atoms
O  1.722339 2.295185 0.190533
O  0.096893 -2.293367 0.584583
O  -2.441327 -1.434136 -0.046547
O  -3.022013 1.156248 -0.379459
O  3.170524 -0.901214 1.152549
C  0.986244 0.051955 0.395435
C  0.637515 1.407229 0.120709
C  -0.058659 -0.931602 0.35525
C  2.410747 0.030649 0.751747
C  2.904456 1.484773 0.577789
C  -1.393446 -0.515419 0.099593
C  -0.657523 1.850654 -0.157691
C  -1.683512 0.870387 -0.14588
C  1.290222 -2.989156 0.044329
C  -2.841126 -2.159819 1.179047
C  -3.376113 2.543777 -0.706348
H  3.312892 1.890165 1.518866
H  3.661523 1.558213 -0.222118
H  -0.847529 2.908536 -0.3460
H  1.09965 -4.053955 0.244024
H  2.205549 -2.642027 0.551642
H  1.359088 -2.815881 -1.045686
H  -3.192637 -1.447491 1.949952
H  -2.001272 -2.762834 1.564712
H  -3.670664 -2.812171 0.86699
H  -3.136315 3.22528 0.131977
H  -4.462224 2.524714 -0.874008
H  -2.858784 2.880207 -1.624492
