program: Gaussian 09
title: 000259234
version: EM64L-G09RevD.01
frameworkgroup: C1[X(C15H9BrN2O2)]
method: RPBEPBE
basis: SDD
operation: Freq
keyword: #p
keyword: freq=noraman
keyword: PBEPBE/SDD
title: #p freq=noraman PBEPBE/SDD
converged: NO YES NO NO
title: Mulliken charges:
elementType: Br O O N N C C C C C C C C C C C C C C C H H H H H H H H H
charge: 0.020664 -0.171796 -0.220998 -0.403338 -0.400989 -0.221980 0.356511 0.372340 0.187697 0.165434 0.153245 -0.367079 -0.426788 0.177235 -0.385309 -0.390628 -0.228033 -0.233070 -0.184464 -0.228592 0.327563 0.276001 0.258337 0.353342 0.250529 0.244480 0.233909 0.252935 0.232843
chargesum: 0.00000
title: Mulliken charges with hydrogens summed into heavy atoms:
elementType: Br O O N N C C C C C C C C C C C C C C C
charge: 0.020664 -0.171796 -0.220998 -0.075775 -0.047647 -0.221980 0.356511 0.372340 0.187697 0.165434 0.153245 -0.091079 -0.168451 0.177235 -0.134780 -0.146148 -0.228033 0.000839 0.068471 0.004251
polarizability: 2.83489031e+02 1.48774618e+01 2.19452932e+02 4.38917308e+00 -6.39928286e+00 1.02997339e+02
1716.lowfreq: -5.9754 -4.7163 -0.0009 -0.0008 -0.0006 1.8039 40.9446 45.3932 65.4482
frequency: 40.9395 45.3874 65.4479 84.7796 118.0997 134.5763 153.7076 185.2339 200.4625 252.2207 274.4741 279.2498 330.7710 333.1129 407.2059 428.2705 457.8707 466.0975 499.7267 507.3588 528.1498 567.0813 592.5054 601.8905 628.3739 636.9629 652.7595 682.3102 700.1999 716.3464 726.5791 751.0406 761.1457 784.7901 794.5412 842.5464 889.6203 897.4956 921.3917 950.6175 958.1760 962.7453 980.2596 993.0782 996.2723 1027.5293 1056.4236 1076.9411 1114.0413 1130.3125 1170.2709 1178.9002 1182.1171 1204.6507 1236.8781 1273.4754 1302.0224 1307.8598 1314.4321 1361.1098 1366.2209 1384.9280 1419.2767 1439.7642 1457.9002 1483.0858 1583.5775 1598.6434 1606.8809 1618.3001 1686.1094 1721.3670 3130.3395 3136.6610 3145.4693 3150.0401 3159.0666 3168.2551 3173.7994 3587.0804 3606.9903
redmass: 8.9412 8.0926 6.8549 7.3189 6.5308 4.4416 7.9141 6.4380 8.3933 9.2896 7.2529 6.3406 5.1509 5.4807 8.2810 3.1388 2.4638 6.8974 3.6117 1.7390 3.4275 3.4611 3.8712 10.5435 4.7043 6.9090 1.3777 6.1668 8.5398 5.3214 5.8880 3.3747 2.2248 2.8898 2.1277 1.6138 1.5981 1.5403 7.5566 1.8107 3.3419 1.4230 3.1954 1.3452 6.5154 2.1215 1.9789 4.2644 1.9638 1.7969 1.3741 3.4480 1.9946 3.0986 1.6829 1.5030 1.8916 2.6118 2.9246 1.7262 7.9385 3.8771 3.9569 2.4718 2.5951 4.1242 8.2959 7.0804 7.6701 7.2298 8.7031 9.6997 1.0861 1.0900 1.0897 1.0945 1.0932 1.1003 1.0961 1.0802 1.0804
irintensity: 0.0309 0.0712 0.6103 0.4438 0.0425 0.6315 1.6802 0.1373 1.1954 3.4629 1.7944 1.2664 0.8629 4.1603 14.4419 18.8493 11.1792 10.3983 9.9533 50.2597 13.7647 3.1364 5.6600 9.3154 6.9640 0.0679 127.3389 13.9756 14.2975 12.7186 41.7731 35.6737 58.3643 14.0665 27.2016 23.2797 0.3342 4.3770 1.2179 3.3848 8.2327 0.4032 37.5810 0.2531 8.4775 3.1131 23.5779 19.1995 4.6799 0.9559 9.2157 70.4136 48.3020 45.6934 7.5320 10.4741 1.3131 178.5460 100.1910 5.6352 1.7933 12.7613 35.7833 51.8754 21.4789 8.0476 11.5598 1.0197 6.9821 6.2571 556.2300 424.7766 2.6735 2.8212 3.5224 20.2712 0.6684 30.2523 5.7593 87.9661 47.9277
temp: 298.150 k
press: 1.00000 atm
elementType: 35 8 8 7 7 6 6 6 6 6 6 6 6 6 6 6 6 6 6 6 1 1 1 1 1 1 1 1 1
symmnumber: 1
zpe: 540368.7 jmol-1
zpe.correction: 0.205816 hartree
zpe.thermalcorrener: 0.221468 hartree
zpe.thermalcorrenthalpy: 0.222412 hartree
zpe.thermalcorrgfe: 0.161313 hartree
zpe.sumelectzpe: -849.103368 hartree
zpe.sumelectthermal: -849.087716 hartree
zpe.sumelectthermalent: -849.086772 hartree
zpe.sumelectthermalfe: -849.147871 hartree
dipole: -1.7460 -3.4467 -1.3385
dipole: 4.0890
quadrupole: -115.9652 -119.3947 -133.8663
quadrupole: 4.6348 1.2138 8.8692
quadrupole: 7.1102 3.6807 -10.7909 4.6348 1.2138 8.8692
hfenergy: -849.3091838 hartree
pointgroup: C01 [X(C15H9Br1N2O2)]
dipole: 0.6376734 1.388647 -0.5030634 debye
polarizability: 282.1871356|17.4878398|220.761125|-0.9058429|7.4726998|102.9910417 unknown
InChI: InChI=1S/C15H9BrN2O2/c16-8-5-6-10-9-3-1-2-4-11(9)15(12(10)7-8)13(19)17-14(20)18-15/h1-7,17-18H
charge 0 multiplicity 1
29 atoms
Br -5.153206 -0.34631 -0.18085
O  0.482681 -1.146031 2.422652
O  1.017943 -4.067044 -1.240987
N  0.57433 -1.729972 -1.104496
N  0.797405 -2.861594 0.815283
C  0.395588 -0.698949 -0.069378
C  -0.952048 0.040307 -0.098872
C  1.400469 0.463838 -0.113847
C  -0.741125 1.446925 -0.070336
C  0.712393 1.709187 -0.080363
C  0.556024 -1.555133 1.245727
C  -2.238956 -0.514982 -0.129237
C  2.800392 0.403377 -0.161818
C  0.817373 -3.003536 -0.610843
C  -1.846586 2.321671 -0.058894
C  1.437193 2.918662 -0.083675
C  -3.332315 0.381288 -0.127553
C  3.528233 1.620073 -0.173894
C  -3.15493 1.782601 -0.087724
C  2.850665 2.863585 -0.130401
H  0.545401 -1.537057 -2.10378
H  -2.397778 -1.596897 -0.15515
H  3.325228 -0.557879 -0.191359
H  0.945883 -3.655075 1.439197
H  -1.711453 3.407709 -0.03026
H  0.923334 3.885421 -0.052571
H  4.622482 1.600071 -0.213218
H  -4.026227 2.443532 -0.081961
H  3.430107 3.793213 -0.134995
