program: Gaussian 09
title: 000259244
version: EM64L-G09RevD.01
frameworkgroup: C1[X(C16H14BrNO3)]
method: RPBEPBE
basis: SDD
operation: Freq
keyword: #p
keyword: freq=noraman
keyword: PBEPBE/SDD
title: #p freq=noraman PBEPBE/SDD
converged: NO YES NO NO
title: Mulliken charges:
elementType: Br O O O N C C C C C C C C C C C C C C C C H H H H H H H H H H H H H H
charge: 0.012960 -0.427791 -0.305486 -0.267191 -0.472571 -0.331037 0.257414 0.194366 0.196237 0.181687 -0.544191 -0.378023 -0.399810 -0.388034 0.696222 -0.558361 -0.232363 -0.229962 0.260365 -0.214472 -0.672200 0.255686 0.334053 0.260534 0.260745 0.240264 0.230019 0.228472 0.340144 0.335436 0.230106 0.231210 0.213799 0.230829 0.230946
chargesum: 0.00000
title: Mulliken charges with hydrogens summed into heavy atoms:
elementType: Br O O O N C C C C C C C C C C C C C C C C
charge: 0.012960 -0.087647 -0.305486 -0.267191 -0.137136 -0.075352 0.257414 0.194366 0.196237 0.181687 -0.210138 -0.117489 -0.139066 -0.147770 0.696222 -0.558361 -0.002344 -0.001490 0.260365 0.246844 0.003374
polarizability: 3.71754361e+02 -3.95961951e+00 2.25544379e+02 -1.31884426e+00 3.11422353e+00 9.47954381e+01
1716.lowfreq: -2.5160 -0.0007 -0.0005 -0.0004 3.4626 4.7707 24.8027 37.0057 58.2925
frequency: 24.7959 36.9940 58.2898 64.6682 66.4761 79.8098 111.9656 116.3503 140.0132 158.3665 175.7568 190.5805 207.2186 236.0568 250.7892 264.2152 302.3461 352.9104 361.9665 365.3472 402.1787 404.3557 444.2450 457.6645 475.8881 529.7367 558.7448 607.2399 614.5323 629.2375 671.1028 684.1676 709.9896 716.6701 731.2030 738.6469 752.4165 769.9572 795.4961 800.6461 827.9715 853.4639 878.5560 884.9088 936.5449 950.4246 953.2672 971.8020 989.4272 997.0595 1000.1635 1026.5001 1044.8993 1099.2020 1112.2385 1139.1280 1139.8217 1168.2385 1173.2234 1179.3593 1198.2906 1204.5724 1207.0413 1245.6168 1250.3637 1284.1089 1308.1885 1348.5105 1354.5887 1364.4275 1386.7911 1401.1662 1429.9128 1441.2742 1453.3221 1463.5808 1475.8798 1483.1417 1488.3548 1509.6947 1582.2278 1594.9814 1618.3366 1624.1687 1657.1801 2997.1100 3009.6905 3025.1420 3068.5850 3094.1677 3109.0668 3126.0444 3136.1806 3147.9564 3162.6606 3164.6915 3175.9945 3490.8147 3545.2457
redmass: 3.7783 3.1296 4.9876 4.9913 8.0828 3.5587 5.5247 5.7680 4.0511 5.5285 5.1946 5.9782 5.0542 6.4825 1.2698 4.9914 6.9292 1.8684 3.4505 2.2464 4.9652 5.1030 3.2795 4.0156 5.2677 4.9815 4.7192 6.9843 5.5382 4.9612 2.0461 7.0434 6.6482 3.4824 2.9173 3.1912 2.3171 2.5182 3.1598 1.0954 3.8732 3.7332 1.3859 1.5788 2.1583 2.2455 1.4223 6.2923 1.3269 2.9075 6.1934 2.1703 3.5399 1.9530 2.2166 1.4878 2.3346 1.2435 3.1923 1.6233 1.6221 1.2893 2.5832 1.3315 1.1312 1.7173 2.5396 2.3692 1.1760 2.0052 4.3553 1.2673 5.6980 2.4553 2.8314 1.0402 1.0684 3.8872 1.1121 2.4965 6.2985 6.7069 7.3876 7.6914 7.8776 1.0358 1.0580 1.0833 1.1070 1.0985 1.1027 1.0857 1.0894 1.0949 1.0927 1.1002 1.0928 1.0759 1.0663
irintensity: 1.0252 0.0570 0.7766 1.7263 1.8398 0.1275 1.3268 1.1986 4.9812 4.2110 0.4893 0.2948 0.4344 0.7316 1.0025 0.5444 16.4538 53.2113 1.5990 66.3813 8.0689 1.6889 5.3346 22.0160 16.8093 0.9458 1.7097 9.7840 9.2360 8.7664 5.9418 7.9674 14.9466 37.5482 77.7943 5.6400 26.6682 62.3365 6.9285 4.5324 9.9849 10.3944 11.9656 0.7690 28.9576 8.0623 2.2764 101.1401 0.0076 65.2827 12.9742 10.6983 308.7842 2.8930 24.2366 8.8219 108.5470 31.2191 529.4241 7.4743 6.9488 24.5939 3.6802 32.0200 0.0099 6.8957 22.7995 82.5584 40.1676 16.0479 42.1991 26.9234 15.6410 40.1368 27.2852 12.2886 34.2628 1.4885 48.5311 741.8429 130.8792 4.6973 43.6290 56.8574 189.8760 23.1750 24.2563 7.7714 8.7868 30.1365 43.8725 3.0284 3.4016 21.7899 0.8279 38.8703 11.8465 70.1451 9.0306
temp: 298.150 k
press: 1.00000 atm
elementType: 35 8 8 8 7 6 6 6 6 6 6 6 6 6 6 6 6 6 6 6 6 1 1 1 1 1 1 1 1 1 1 1 1 1 1
symmnumber: 1
zpe: 693919.7 jmol-1
zpe.correction: 0.264300 hartree
zpe.thermalcorrener: 0.283609 hartree
zpe.thermalcorrenthalpy: 0.284553 hartree
zpe.thermalcorrgfe: 0.214436 hartree
zpe.sumelectzpe: -910.522269 hartree
zpe.sumelectthermal: -910.502959 hartree
zpe.sumelectthermalent: -910.502015 hartree
zpe.sumelectthermalfe: -910.572133 hartree
dipole: -0.5561 1.7818 0.4214
dipole: 1.9135
quadrupole: -98.3919 -136.8727 -131.7615
quadrupole: 7.0729 0.8824 0.3337
quadrupole: 23.9502 -14.5307 -9.4195 7.0729 0.8824 0.3337
hfenergy: -910.7865686 hartree
pointgroup: C01 [X(C16H14Br1N1O3)]
dipole: -0.1616727 -0.7077285 -0.1993307 debye
polarizability: 370.1706841|15.5870882|226.5324226|1.6796999|9.4258165|95.391072 unknown
InChI: InChI=1S/C16H14BrNO3/c1-2-21-16(20)18-14-8-12-11(7-13(14)17)9-5-3-4-6-10(9)15(12)19/h3-8,15,18-19H,2H2,1H3
charge 0 multiplicity 1
35 atoms
Br -1.651595 -3.501277 -0.244237
O  1.609037 2.810954 -0.645738
O  -4.943071 0.006815 0.029944
O  -3.33075 1.707708 0.258804
N  -2.76939 -0.588749 0.002155
C  1.798244 1.704619 0.310727
C  0.795242 0.555149 0.172236
C  3.143724 0.981794 0.197087
C  1.48706 -0.685069 0.060432
C  2.942484 -0.42572 0.075094
C  -0.600375 0.627862 0.158681
C  0.757759 -1.884993 -0.059215
C  4.43614 1.528089 0.209292
C  4.045873 -1.298939 -0.024241
C  -1.358275 -0.575997 0.030482
C  -0.647843 -1.810391 -0.071865
C  5.546824 0.651475 0.100605
C  5.350142 -0.747435 -0.010119
C  -3.629747 0.49663 0.111152
C  -6.013971 1.040645 0.138237
C  -7.343922 0.309017 -0.00768
H  1.692945 2.211862 1.287478
H  -1.130149 1.5799 0.237969
H  1.254799 -2.855255 -0.142699
H  4.581788 2.610438 0.293251
H  3.906794 -2.382282 -0.112691
H  6.564545 1.056901 0.104105
H  6.219251 -1.410196 -0.088159
H  1.681919 2.444404 -1.56471
H  -3.225259 -1.500682 -0.104742
H  -5.913582 1.544619 1.11656
H  -5.854757 1.792636 -0.655586
H  -8.17559 1.033044 0.066865
H  -7.410775 -0.197214 -0.985642
H  -7.468924 -0.446363 0.786667
