program: Gaussian 09
title: 000259243
version: EM64L-G09RevD.01
frameworkgroup: C1[X(C16H12BrNO3)]
method: RPBEPBE
basis: SDD
operation: Freq
keyword: #p
keyword: freq=noraman
keyword: PBEPBE/SDD
title: #p freq=noraman PBEPBE/SDD
converged: YES YES NO NO
title: Mulliken charges:
elementType: Br O O O N C C C C C C C C C C C C C C C C H H H H H H H H H H H H
charge: 0.028994 -0.144466 -0.304512 -0.260417 -0.472333 0.289013 0.263108 0.280752 0.217432 -0.314360 -0.546485 -0.376264 0.696135 -0.395189 -0.416097 -0.561315 -0.217781 -0.231994 0.261898 -0.214601 -0.671724 0.350679 0.264403 0.246598 0.280814 0.231820 0.237102 0.336961 0.232281 0.232305 0.215176 0.231032 0.231032
chargesum: 0.00000
title: Mulliken charges with hydrogens summed into heavy atoms:
elementType: Br O O O N C C C C C C C C C C C C C C C C
charge: 0.028994 -0.144466 -0.304512 -0.260417 -0.135373 0.289013 0.263108 0.280752 0.217432 -0.314360 -0.195806 -0.111861 0.696135 -0.148590 -0.135282 -0.561315 0.014039 0.005109 0.261898 0.249985 0.005517
polarizability: 3.85244259e+02 -6.88972656e+00 2.36160468e+02 4.34524512e-02 4.11762199e-02 8.44764691e+01
1716.lowfreq: -1.3959 -0.0005 0.0003 0.0006 3.4889 5.7778 17.6744 35.8473 58.4627
frequency: 17.5122 35.8302 58.4607 62.4387 67.4679 84.9960 113.7344 135.0365 147.4998 159.3231 190.1590 211.5698 223.4189 225.2691 253.5300 276.9325 302.1016 362.8023 363.2236 410.8454 423.1683 441.1513 470.6904 491.1108 529.0626 584.6511 606.9428 618.2470 654.8418 669.3104 700.3303 712.1312 723.2225 728.2917 747.7008 754.8311 779.7910 799.7013 834.7516 837.3329 864.4297 886.2829 901.6714 961.2217 964.2805 972.4939 997.1873 997.9009 1000.2675 1030.4091 1044.2508 1079.0178 1111.7086 1117.3372 1139.2543 1165.2553 1168.1681 1187.4555 1197.9679 1239.5368 1250.2308 1275.0705 1298.9762 1344.2666 1361.5655 1384.3198 1401.2339 1433.1834 1440.8272 1448.5134 1463.8717 1475.6676 1480.5723 1488.2233 1510.7606 1582.6410 1599.3010 1604.1193 1623.5337 1639.0487 1660.9200 2996.9492 3011.1503 3070.4520 3094.2468 3108.8094 3129.8705 3142.5139 3152.4738 3162.7721 3168.5035 3174.9715 3494.8369
redmass: 2.7972 4.1332 5.0492 6.8165 7.1659 3.6280 9.2120 4.6400 4.5354 5.7746 6.4988 5.6051 19.7247 4.7040 1.2250 8.4835 7.0035 5.0486 3.7416 7.6547 4.0125 3.0881 5.9812 4.3958 6.4722 7.4497 7.4873 4.5876 7.6570 1.9067 4.6421 6.6521 7.0319 2.4851 5.6292 1.6578 2.4098 1.0955 5.3806 3.1371 4.8627 1.4545 1.5988 1.4159 5.8497 1.5372 3.2348 1.3616 4.5872 2.1602 3.3723 2.6534 2.2396 2.4316 1.4617 2.2216 1.6100 2.1335 2.4314 1.3743 1.1309 1.9298 2.1384 3.0842 1.6997 3.8127 1.2658 4.3998 2.5778 2.7407 1.0403 1.0733 4.1962 1.0954 2.5041 7.1127 7.1226 7.9341 7.6841 10.5195 7.9355 1.0358 1.0581 1.1070 1.0986 1.1029 1.0863 1.0899 1.0948 1.0928 1.1002 1.0932 1.0759
irintensity: 0.7791 1.3184 0.9025 3.0076 0.5195 0.0711 0.1705 7.2372 2.3056 3.6185 0.4222 0.1962 0.3462 0.0221 0.9145 12.9354 10.4513 0.1169 8.6131 1.0923 5.9554 5.4949 15.3067 11.7136 0.5595 4.5088 5.6021 2.8880 5.9815 10.4521 2.2951 5.8011 7.2018 114.7846 8.0357 31.0200 42.9118 4.4556 23.3612 0.7156 24.0121 12.1725 0.1928 9.8510 28.6148 22.1634 86.0481 0.2951 5.7896 12.9135 309.4383 10.1514 68.4235 42.5238 5.1348 513.2249 168.3206 0.4071 8.1882 32.1855 0.0020 7.8533 48.1159 120.1743 6.0466 59.6675 26.1894 23.7561 13.3095 75.0467 12.4998 36.7554 1.5206 44.1337 829.7857 87.0146 63.2919 199.8736 52.9796 36.7575 214.2889 22.6616 22.3515 7.2820 29.1762 44.0977 3.1458 5.0851 13.2156 1.0318 33.6083 16.5477 64.9895
temp: 298.150 k
press: 1.00000 atm
elementType: 35 8 8 8 7 6 6 6 6 6 6 6 6 6 6 6 6 6 6 6 6 1 1 1 1 1 1 1 1 1 1 1 1
symmnumber: 1
zpe: 635874.4 jmol-1
zpe.correction: 0.242192 hartree
zpe.thermalcorrener: 0.260821 hartree
zpe.thermalcorrenthalpy: 0.261765 hartree
zpe.thermalcorrgfe: 0.192604 hartree
zpe.sumelectzpe: -909.355410 hartree
zpe.sumelectthermal: -909.336781 hartree
zpe.sumelectthermalent: -909.335837 hartree
zpe.sumelectthermalfe: -909.404997 hartree
dipole: -0.7135 3.8469 0.0024
dipole: 3.9125
quadrupole: -88.4408 -139.4503 -133.6010
quadrupole: 11.5319 0.0040 -0.0044
quadrupole: 32.0566 -18.9530 -13.1036 11.5319 0.0040 -0.0044
hfenergy: -909.5976016 hartree
pointgroup: C01 [X(C16H12Br1N1O3)]
dipole: -0.1755622 1.529236 0.000951 debye
polarizability: 383.585209|-17.0895702|237.8195188|0.0461909|0.0380789|84.4764691 unknown
InChI: InChI=1S/C16H12BrNO3/c1-2-21-16(20)18-14-8-12-11(7-13(14)17)9-5-3-4-6-10(9)15(12)19/h3-8,18H,2H2,1H3
charge 0 multiplicity 1
33 atoms
Br -1.639464 3.535527 -0.000236
O  1.615993 -2.87116 -0.001219
O  -4.910613 -0.012925 -0.000978
O  -3.277684 -1.709473 -0.00149
N  -2.745034 0.607521 -0.001522
C  1.514575 0.732816 -0.000061
C  0.824537 -0.514761 -0.000663
C  2.97687 0.472432 0.000298
C  3.178745 -0.941838 -0.00009
C  1.840715 -1.630904 -0.000637
C  -0.569383 -0.604164 -0.001146
C  0.779677 1.928886 0.000068
C  -1.335934 0.602489 -0.001027
C  4.081546 1.341592 0.000878
C  4.464802 -1.502248 0.000078
C  -0.630649 1.844281 -0.000412
C  5.386015 0.777719 0.001059
C  5.580348 -0.625263 0.000663
C  -3.594516 -0.495476 -0.002128
C  -5.974174 -1.061453 -0.000001
C  -7.310601 -0.327671 0.001166
H  -1.081501 -1.569494 -0.001612
H  1.265759 2.908214 0.000514
H  3.953958 2.429622 0.001177
H  4.591929 -2.589827 -0.000225
H  6.258368 1.440875 0.001507
H  6.597424 -1.031083 0.000814
H  -3.211707 1.519983 -0.001349
H  -5.838841 -1.694128 -0.89564
H  -5.837266 -1.694105 0.895414
H  -8.136659 -1.06179 0.001907
H  -7.411378 0.308867 0.896681
H  -7.412959 0.308837 -0.89419
