program: Gaussian 09
title: 000259245
version: EM64L-G09RevD.01
frameworkgroup: C1[X(C16H11BrClNO3)]
method: RPBEPBE
basis: SDD
operation: Freq
keyword: #p
keyword: freq=noraman
keyword: PBEPBE/SDD
title: #p freq=noraman PBEPBE/SDD
converged: YES YES NO YES
title: Mulliken charges:
elementType: Br Cl O O O N C C C C C C C C C C C C C C C C H H H H H H H H H H H
charge: 0.078532 0.000371 -0.143440 -0.303279 -0.257136 -0.479462 0.438460 0.261888 0.333587 0.218116 -0.322270 -0.604613 -0.295166 0.742832 -0.398299 -0.637432 -0.417184 -0.220007 -0.231817 0.263746 -0.215268 -0.671090 0.354718 0.271073 0.282099 0.233093 0.238216 0.334519 0.233174 0.233171 0.216065 0.231403 0.231403
chargesum: 0.00000
title: Mulliken charges with hydrogens summed into heavy atoms:
elementType: Br Cl O O O N C C C C C C C C C C C C C C C C
charge: 0.078532 0.000371 -0.143440 -0.303279 -0.257136 -0.144943 0.438460 0.261888 0.333587 0.218116 -0.322270 -0.249896 -0.295166 0.742832 -0.127227 -0.637432 -0.135086 0.013086 0.006399 0.263746 0.251076 0.007781
polarizability: 3.92198444e+02 9.51318921e+00 2.56725337e+02 8.12422111e-03 -6.34172105e-03 8.73155218e+01
1716.lowfreq: -1.1539 0.0008 0.0012 0.0017 2.5394 3.1937 17.5345 35.3127 50.8723
frequency: 17.3041 35.3077 50.8714 58.3823 62.9866 71.9185 103.3155 126.6015 134.7130 153.8262 162.4898 184.3873 204.0887 223.2046 229.2237 252.2519 268.0902 280.2762 303.9426 317.2401 360.2659 366.1381 423.1171 468.0954 486.0419 491.1136 535.7311 537.4416 611.9029 618.0562 622.0296 670.6206 671.5421 705.8171 725.8014 730.4920 747.7148 763.3753 789.5535 792.1708 799.9026 838.3299 848.5064 873.3801 904.7430 963.8484 970.9230 976.2251 1000.4646 1001.3680 1012.8745 1036.0224 1056.8976 1082.0537 1112.7132 1134.8418 1139.0272 1164.8148 1170.7460 1198.6223 1200.3789 1250.3720 1276.4848 1290.9002 1332.6281 1360.3316 1368.5558 1401.4711 1423.4023 1432.7193 1449.7421 1463.7218 1472.5693 1475.3722 1487.6998 1505.0137 1559.7515 1592.2445 1604.9467 1622.0015 1638.8222 1661.2471 2997.3579 3011.4972 3071.1013 3094.6316 3109.1896 3136.4466 3149.9104 3166.3152 3178.1787 3185.9243 3490.7455
redmass: 2.8529 4.2721 12.9317 4.9893 8.0557 4.5932 4.4610 8.8321 4.6128 5.4621 6.3155 17.6200 8.1131 4.6373 17.1813 1.2338 7.0161 8.3621 7.3678 13.7400 5.5368 3.7802 3.7994 6.6675 4.4487 8.3561 7.5098 5.6230 7.4214 9.5748 4.3089 7.0173 2.1581 4.1558 7.0591 2.4740 5.9486 1.4906 4.4059 9.0175 1.0957 3.1655 4.4981 6.3707 1.4717 1.4405 6.6062 1.5267 1.3603 5.6335 2.8854 2.3755 4.4936 2.5530 2.2163 2.3521 1.4601 3.2959 1.2261 2.1903 2.5416 1.1317 2.9534 1.7179 3.4829 1.4648 5.3657 1.2654 4.9003 2.5442 2.7605 1.0402 4.7287 1.0712 1.1077 2.6345 5.9082 7.1859 7.7920 7.8953 10.9029 7.8891 1.0358 1.0580 1.1070 1.0986 1.1029 1.0863 1.0916 1.0981 1.0934 1.0955 1.0759
irintensity: 0.6511 0.7954 1.2991 0.8932 2.8526 0.0713 0.7068 0.3537 7.0450 1.9386 3.9566 1.1398 0.8095 0.0007 0.0768 0.6881 4.1121 13.5892 8.4698 2.9176 0.6350 8.4480 2.8118 11.2090 5.8820 8.8077 0.3373 3.1980 6.8809 10.9089 3.2151 0.3034 9.1867 4.2656 7.0838 115.3536 7.7505 58.1242 9.4688 9.0931 4.4200 0.3999 39.1647 45.4391 0.9268 12.8956 8.8539 20.2998 0.0548 5.4150 35.7623 77.5536 307.6979 48.0529 19.5119 30.2619 5.2118 751.3556 3.3795 5.9534 21.4367 0.0003 29.3657 18.6983 174.2150 5.4493 33.7666 25.9732 19.5703 15.0457 76.5350 12.6537 3.7997 45.0931 57.3744 724.4661 146.4972 111.8361 180.9305 74.7871 41.9873 208.7414 22.0438 21.7474 6.9294 28.4282 43.3214 2.7051 7.8012 27.7882 19.3329 8.3452 65.3799
temp: 298.150 k
press: 1.00000 atm
elementType: 35 17 8 8 8 7 6 6 6 6 6 6 6 6 6 6 6 6 6 6 6 6 1 1 1 1 1 1 1 1 1 1 1
symmnumber: 1
zpe: 610726.0 jmol-1
zpe.correction: 0.232613 hartree
zpe.thermalcorrener: 0.252569 hartree
zpe.thermalcorrenthalpy: 0.253513 hartree
zpe.thermalcorrgfe: 0.181182 hartree
zpe.sumelectzpe: -1368.738695 hartree
zpe.sumelectthermal: -1368.718740 hartree
zpe.sumelectthermalent: -1368.717795 hartree
zpe.sumelectthermalfe: -1368.790126 hartree
dipole: 1.2517 2.5736 0.0001
dipole: 2.8619
quadrupole: -96.3859 -156.2387 -145.0969
quadrupole: -4.3613 0.0022 0.0007
quadrupole: 36.1880 -23.6649 -12.5231 -4.3613 0.0022 0.0007
hfenergy: -1368.9713087 hartree
pointgroup: C01 [X(C16H11Br1Cl1N1O3)]
dipole: -0.4561452 1.0294107 -0.0000253 debye
polarizability: 391.3508739|-14.3040331|257.5729075|0.0083446|0.0060488|87.3155218 unknown
InChI: InChI=1S/C16H11BrClNO3/c1-2-22-16(21)19-11-7-10-12(14(18)13(11)17)8-5-3-4-6-9(8)15(10)20/h3-7,19H,2H2,1H3
charge 0 multiplicity 1
33 atoms
Br -1.69977 3.416694 0.000058
Cl 1.597195 3.375477 0.00021
O  1.430848 -3.023506 -0.00018
O  -4.980234 -0.067378 -0.000364
O  -3.370337 -1.784676 -0.000282
N  -2.80866 0.527062 -0.000078
C  1.469713 0.582137 0.000168
C  0.734953 -0.643655 0.000103
C  2.926099 0.264611 0.000147
C  3.067422 -1.159112 0.000066
C  1.710821 -1.794844 0.000247
C  -0.656732 -0.711646 0.00001
C  0.733642 1.776967 0.000163
C  -1.40099 0.50527 -0.000002
C  4.077663 1.075095 0.000109
C  -0.687224 1.744527 0.000083
C  4.323815 -1.782552 -0.00009
C  5.351881 0.445165 -0.000024
C  5.481504 -0.964008 -0.00013
C  -3.672298 -0.567464 -0.00017
C  -6.059528 -1.100896 -0.000622
C  -7.384934 -0.347733 -0.000804
H  -1.179488 -1.670817 -0.000021
H  4.006399 2.164798 0.000149
H  4.393381 -2.875316 -0.00014
H  6.253301 1.068115 -0.000063
H  6.477421 -1.419073 -0.000234
H  -3.265608 1.444518 -0.000075
H  -5.93171 -1.73492 -0.896342
H  -5.932022 -1.735036 0.895061
H  -8.221228 -1.070111 -0.000992
H  -7.47775 0.289948 0.894738
H  -7.477442 0.290058 -0.896299
