program: Gaussian 09
title: 000259242
version: EM64L-G09RevD.01
frameworkgroup: C1[X(C14H8Br3NO)]
method: RPBEPBE
basis: SDD
operation: Freq
keyword: #p
keyword: freq=noraman
keyword: PBEPBE/SDD
title: #p freq=noraman PBEPBE/SDD
converged: YES YES NO NO
title: Mulliken charges:
elementType: Br Br Br O N C C C C C C C C C C C C C C H H H H H H H H
charge: 0.043581 0.028598 0.016291 -0.211474 -0.453528 -0.705868 0.413594 0.238133 0.281236 0.185982 -0.596780 -0.405433 -0.365580 -0.366805 0.720777 -0.448096 -0.219425 -0.189635 -0.041665 0.276926 0.272537 0.265253 0.266904 0.248235 0.253206 0.323004 0.170035
chargesum: 0.00000
title: Mulliken charges with hydrogens summed into heavy atoms:
elementType: Br Br Br O N C C C C C C C C C C C C C C
charge: 0.043581 0.028598 0.016291 -0.211474 -0.130525 -0.156405 0.413594 0.238133 0.281236 0.185982 -0.596780 -0.140180 -0.098676 -0.118570 0.720777 -0.448096 -0.219425 0.063571 0.128370
polarizability: 3.75704655e+02 1.71700107e+00 2.28060260e+02 8.78091927e-01 1.75375268e+00 9.00911306e+01
1716.lowfreq: -4.4964 -0.0002 0.0004 0.0006 2.0303 3.5509 32.8921 50.8015 52.9357
frequency: 32.8832 50.7958 52.9319 72.0261 77.5707 107.8132 119.5161 145.5805 173.8625 185.3829 200.9518 203.8296 256.4720 276.7745 277.9937 297.4491 325.1417 381.6596 404.4930 431.9723 478.5097 519.9414 525.0696 534.1568 582.1952 591.3403 616.2146 635.7375 693.9823 699.0218 716.5598 747.1984 786.9764 828.1682 837.7513 850.4661 874.0363 883.3280 945.3409 948.4869 961.7574 965.0857 1018.1117 1057.4995 1111.3453 1119.1026 1138.0542 1172.0045 1182.8479 1206.4858 1215.7998 1270.9515 1309.2202 1333.0158 1364.9467 1374.8447 1410.8324 1416.4841 1419.6168 1431.7673 1454.2605 1468.1695 1552.5088 1576.7332 1601.5211 1611.6057 1653.3625 2940.4656 2990.8982 3034.9398 3142.1424 3160.1343 3168.6741 3175.5965 3505.4301
redmass: 10.0143 10.4358 9.6697 22.6369 4.7114 12.4870 27.3832 7.2429 10.0756 5.7717 6.0831 3.2909 9.0241 8.4712 2.8653 6.6557 4.7755 6.2527 6.0683 3.1078 4.1176 3.8040 4.3413 1.3223 6.3544 4.9874 7.1353 5.6031 5.1452 7.2969 5.8707 3.3063 6.7240 1.4369 6.0175 5.8019 1.4774 1.5182 3.7233 1.9731 1.4683 1.7262 8.8219 2.0955 2.8002 2.1586 1.1378 2.5284 2.0188 1.7808 1.9900 1.3934 3.5407 3.8605 5.5997 1.3131 3.8742 4.7706 1.2792 2.8373 2.1882 2.9896 9.2034 7.9557 9.1087 7.6549 5.8697 1.0874 1.0614 1.0988 1.0900 1.0932 1.0929 1.0957 1.0770
irintensity: 0.7850 5.2757 2.8887 0.3129 0.2354 3.6217 0.9305 2.6915 2.6018 8.7466 11.6904 2.5938 6.1220 11.2108 5.3062 2.1546 5.2113 0.8221 2.6812 8.6848 1.2538 9.1130 1.2146 84.7790 4.2127 8.4825 13.3859 36.2161 4.7317 59.7279 0.5841 1.4631 20.0028 50.5991 4.7861 77.7258 15.5133 3.3346 12.9619 8.8524 2.7473 8.8491 14.2742 26.1864 63.1637 11.2998 0.0916 53.2581 7.2865 20.4393 6.2557 0.6037 11.7063 50.3233 4.2755 5.4532 83.4546 80.2326 19.8160 42.8928 234.1242 39.7428 40.5559 25.5571 28.8967 32.3336 235.5911 143.3413 3.1184 2.2141 5.8619 1.8648 0.8065 5.3738 25.4012
temp: 298.150 k
press: 1.00000 atm
elementType: 35 35 35 8 7 6 6 6 6 6 6 6 6 6 6 6 6 6 6 1 1 1 1 1 1 1 1
symmnumber: 1
zpe: 471841.9 jmol-1
zpe.correction: 0.179715 hartree
zpe.thermalcorrener: 0.196918 hartree
zpe.thermalcorrenthalpy: 0.197862 hartree
zpe.thermalcorrgfe: 0.131369 hartree
zpe.sumelectzpe: -707.354657 hartree
zpe.sumelectthermal: -707.337455 hartree
zpe.sumelectthermalent: -707.336510 hartree
zpe.sumelectthermalfe: -707.403003 hartree
dipole: -0.3878 -1.6685 -3.0640
dipole: 3.5103
quadrupole: -135.7361 -130.2578 -146.8017
quadrupole: 4.8796 13.0831 -4.4128
quadrupole: 1.8625 7.3407 -9.2032 4.8796 13.0831 -4.4128
hfenergy: -707.534372 hartree
pointgroup: C01 [X(C14H8Br3N1O1)]
dipole: -0.0333005 -0.6352631 -1.2258455 debye
polarizability: 373.6096946|11.5682901|228.8338427|18.0447867|5.9671527|91.4125079 unknown
InChI: InChI=1S/C14H8Br3NO/c15-8-1-2-9-7(3-8)4-11-10(9)5-12(16)14(13(11)17)18-6-19/h1-3,5-6,18H,4H2
charge 0 multiplicity 1
27 atoms
Br -2.225222 2.818782 -0.540703
Br -3.265473 -2.946856 -0.498071
Br 6.313836 0.497323 0.413192
O  -4.306148 1.229987 1.54487
N  -3.958992 0.113587 -0.504621
C  0.907679 1.709976 -0.097639
C  -0.249019 0.73094 -0.20554
C  0.234478 -0.612161 -0.167481
C  2.115012 0.78872 0.015592
C  1.699843 -0.576412 -0.027006
C  -1.62128 0.975212 -0.348345
C  -0.65099 -1.704153 -0.274264
C  3.473552 1.124713 0.144844
C  2.648324 -1.618036 0.060696
C  -2.553358 -0.103733 -0.407864
C  -2.025814 -1.428531 -0.383371
C  4.406798 0.066573 0.230744
C  4.017362 -1.292163 0.191437
C  -4.737998 0.736404 0.47692
H  0.797025 2.372698 0.782522
H  0.966165 2.375903 -0.980548
H  -0.293718 -2.73692 -0.260534
H  3.805279 2.166469 0.178877
H  2.344706 -2.669857 0.031175
H  4.771407 -2.08073 0.262311
H  -4.462473 -0.378377 -1.24887
H  -5.81358 0.742141 0.186777
