program: Gaussian 09
title: 000259230
version: EM64L-G09RevD.01
frameworkgroup: C1[X(C11H10N2O4)]
method: RPBEPBE
basis: SDD
operation: Freq
keyword: #p
keyword: freq=noraman
keyword: PBEPBE/SDD
title: #p freq=noraman PBEPBE/SDD
converged: NO YES NO NO
title: Mulliken charges:
elementType: O O O O N N C C C C C C C C C C C H H H H H H H H H H
charge: -0.289366 -0.256361 -0.217658 -0.203498 -0.397077 0.017554 0.195020 0.240829 0.133148 -0.525852 -0.315106 -0.310014 0.402665 -0.368707 0.179844 -0.218031 -0.675545 0.322472 0.333669 0.289617 0.242563 0.287580 0.230471 0.230462 0.215122 0.228098 0.228099
chargesum: 0.00000
title: Mulliken charges with hydrogens summed into heavy atoms:
elementType: O O O O N N C C C C C C C C C C C
charge: -0.289366 -0.256361 -0.217658 -0.203498 -0.074605 0.017554 0.195020 0.240829 0.133148 -0.192183 -0.025489 -0.067451 0.402665 -0.081127 0.179844 0.242902 -0.004226
polarizability: 2.38893179e+02 7.42541848e+00 1.70678720e+02 -1.55614926e-02 -8.49713282e-03 6.63369100e+01
1716.lowfreq: -11.4488 -8.5360 -5.8310 -0.0009 -0.0003 0.0005 21.6976 48.0210 64.4130
frequency: 21.3250 48.0177 64.4126 65.3935 85.0444 117.0841 149.9208 158.0873 224.8403 246.6514 275.2966 285.5583 321.6631 339.4627 365.4247 399.7578 429.4811 506.0053 548.1610 564.4156 586.6901 591.2846 613.0835 669.8825 695.7541 725.8542 758.5820 767.5792 780.6047 796.7452 806.3697 827.3388 833.7714 858.0759 903.0417 961.4139 973.7477 990.4907 1031.7358 1058.3616 1104.0368 1111.7234 1132.5273 1136.6817 1150.3883 1217.8888 1237.0798 1247.9284 1251.4898 1291.5785 1314.1005 1356.4653 1374.4017 1398.2877 1405.4913 1430.0281 1464.2919 1471.7657 1473.7291 1482.4741 1486.6826 1530.1890 1591.3601 1624.6860 1639.2004 2998.0626 3008.9603 3067.9281 3094.2854 3109.7088 3155.2366 3190.2110 3191.7752 3250.3534 3605.7559
redmass: 2.9746 8.7843 5.3194 4.5639 3.8119 5.0025 5.6697 3.5748 7.7652 1.2762 4.7864 5.6234 6.0659 9.5657 3.6824 7.8865 2.9751 7.8305 4.5533 4.6492 1.9508 7.3349 1.7575 8.3431 6.1330 5.4459 9.6088 6.4246 3.9385 1.1056 5.3955 1.6112 4.0596 1.4730 5.2934 1.4342 1.3255 3.3995 2.7170 2.4914 1.5460 2.2268 1.7334 1.4702 2.2417 8.5265 1.5233 1.1312 2.4905 2.5010 3.0300 1.5419 9.1766 1.3914 3.4106 2.3905 1.0408 5.3352 1.0896 4.3430 1.1176 5.8090 7.1180 10.0737 8.2158 1.0360 1.0580 1.1069 1.0984 1.1024 1.0908 1.0939 1.0947 1.0995 1.0812
irintensity: 0.1046 0.0137 0.5256 2.1674 2.3548 1.5865 2.0230 0.7251 4.6468 0.1427 10.3310 8.0055 1.3844 0.3993 10.0015 0.3364 10.4542 0.5919 8.0996 0.5329 46.2610 0.6635 61.2694 16.9470 4.5069 38.3973 20.6269 2.2071 7.0708 1.8866 5.6925 45.2573 2.2561 11.1194 14.6671 24.4271 1.7129 94.2731 123.2047 286.6906 52.3292 4.1277 96.6893 5.6278 186.7773 320.5151 28.5128 0.0034 32.9156 44.0707 31.9670 7.1130 135.2753 89.0379 98.5633 21.4941 12.3752 39.7561 2.2312 4.8783 10.2691 75.7588 10.5450 76.0061 154.3381 23.4774 19.8083 8.7739 29.6934 45.2145 7.4718 3.8545 11.3565 2.2210 87.2495
temp: 298.150 k
press: 1.00000 atm
elementType: 8 8 8 8 7 7 6 6 6 6 6 6 6 6 6 6 6 1 1 1 1 1 1 1 1 1 1
symmnumber: 1
zpe: 520633.7 jmol-1
zpe.correction: 0.198299 hartree
zpe.thermalcorrener: 0.213371 hartree
zpe.thermalcorrenthalpy: 0.214315 hartree
zpe.thermalcorrgfe: 0.154052 hartree
zpe.sumelectzpe: -834.292683 hartree
zpe.sumelectthermal: -834.277611 hartree
zpe.sumelectthermalent: -834.276667 hartree
zpe.sumelectthermalfe: -834.336930 hartree
dipole: 5.6981 7.8856 -0.0018
dipole: 9.7288
quadrupole: -101.8228 -87.8081 -98.7332
quadrupole: -14.5118 0.0093 0.0031
quadrupole: -5.7015 8.3133 -2.6118 -14.5118 0.0093 0.0031
hfenergy: -834.4909819 hartree
pointgroup: C01 [X(C11H10N2O4)]
dipole: -2.2723931 -3.0800846 -0.0007127 debye
polarizability: 239.0334275|6.7490905|170.5384722|0.0156448|0.0083428|66.33691 unknown
InChI: InChI=1S/C11H10N2O4/c1-2-17-11(14)9-6-12-10-4-3-7(13(15)16)5-8(9)10/h3-6,12H,2H2,1H3
charge 0 multiplicity 1
27 atoms
O  -3.483504 0.212705 -0.000177
O  -1.792559 1.82792 -0.000194
O  4.770917 1.031257 0.000991
O  3.094805 2.575427 0.000827
N  -0.420869 -2.653448 -0.000177
N  3.5190 1.356826 0.000066
C  0.226098 -0.461531 -0.000199
C  0.705255 -1.81912 -0.000108
C  -1.22736 -0.525876 -0.000344
C  1.151191 0.605643 -0.000157
C  -1.579228 -1.879632 -0.000294
C  2.080459 -2.140918 0.000023
C  2.517308 0.264844 0.000006
C  2.995156 -1.077208 0.000071
C  -2.140815 0.619205 -0.0005
C  -4.491452 1.31473 0.000142
C  -5.866249 0.654041 0.000469
H  -0.39704 -3.671253 -0.000143
H  0.825704 1.648575 -0.000225
H  -2.572353 -2.32157 -0.000364
H  2.430576 -3.177536 0.000092
H  4.073904 -1.249631 0.000186
H  -4.319344 1.940188 0.894801
H  -4.319807 1.940272 -0.894547
H  -6.652635 1.430471 0.000707
H  -6.003059 0.024053 -0.894535
H  -6.002597 0.023973 0.895487
