program: Gaussian 09
title: 000259229
version: EM64L-G09RevD.01
frameworkgroup: C1[X(C10H11ClO5)]
method: RPBEPBE
basis: SDD
operation: Freq
keyword: #p
keyword: freq=noraman
keyword: PBEPBE/SDD
title: #p freq=noraman PBEPBE/SDD
converged: NO YES NO NO
title: Mulliken charges:
elementType: Cl O O O O O C C C C C C C C C C H H H H H H H H H H H
charge: -0.041170 -0.309660 -0.329090 -0.394088 -0.460404 -0.307056 0.098108 0.153292 0.150999 -0.043275 0.335123 -0.526764 0.285685 -0.678644 -0.488211 -0.517801 0.273345 0.290566 0.290195 0.387352 0.391354 0.225825 0.246426 0.246136 0.237486 0.237588 0.246681
chargesum: 0.00000
title: Mulliken charges with hydrogens summed into heavy atoms:
elementType: Cl O O O O O C C C C C C C C C C
charge: -0.041170 -0.309660 -0.329090 -0.006736 -0.069050 -0.307056 0.098108 0.153292 0.150999 -0.043275 0.335123 -0.253419 0.285685 -0.097883 0.230177 0.203955
polarizability: 2.20910618e+02 1.27455716e+00 1.56991140e+02 -5.59862081e-02 -5.90783674e-03 6.64935949e+01
1716.lowfreq: -50.1594 -5.6189 -3.5186 -0.0002 0.0013 0.0014 6.7149 22.2087 72.8150
frequency: -50.1351 22.1955 72.8068 104.6658 120.7363 121.1559 145.6265 175.0275 179.6730 186.2734 218.4959 222.7118 236.4628 282.2438 321.4061 322.9467 365.9853 394.3785 416.6291 434.8746 452.1040 459.1283 524.8185 534.9943 575.5411 584.8418 663.9219 691.0105 708.0480 737.9085 744.4665 831.2395 861.5218 876.9868 904.7051 948.8340 987.9472 1025.8613 1083.3236 1108.1912 1116.5275 1127.0702 1143.5641 1157.9780 1162.2364 1192.2403 1221.7062 1252.4829 1264.1703 1321.8724 1337.2487 1392.7189 1400.4037 1430.2904 1439.1926 1451.8640 1456.3373 1462.7486 1464.4416 1469.9727 1485.2071 1560.4952 1592.1576 1645.6088 2620.7893 2981.6901 3012.2558 3065.1739 3078.7596 3129.7245 3133.4365 3138.0173 3138.2349 3194.0180 3491.8368
redmass: 3.1904 8.8086 3.5100 6.4690 7.9362 3.5249 3.2394 3.4245 1.4841 1.2051 6.6960 2.9595 6.1686 4.6335 5.8904 4.8020 8.6969 6.6423 6.5553 5.9180 8.4521 1.1055 7.3755 3.1152 8.2881 4.1792 7.1202 6.5437 4.7590 3.3904 6.6757 1.8688 6.3944 8.1518 1.9111 7.5858 1.0636 4.9050 5.9896 1.2411 1.2538 3.7478 1.1040 1.4494 1.6014 1.5535 1.7037 2.3274 1.8373 3.7221 4.0881 1.3771 3.0677 1.7419 1.3189 1.6915 1.0512 1.0540 1.0492 1.2669 2.3942 4.1075 3.8034 5.3235 1.0737 1.0315 1.0279 1.0579 1.1052 1.1057 1.1063 1.1017 1.1059 1.0920 1.0643
irintensity: 5.5536 0.2165 6.0692 0.0977 1.6133 1.7864 6.2360 3.9498 0.0774 0.4170 2.7539 0.4234 0.4101 0.2674 4.3338 6.8657 0.0116 1.4955 15.7747 4.6108 3.6617 138.8161 7.7710 0.3553 47.3618 0.8181 6.4146 41.7095 18.4170 1.0044 31.8107 49.2235 79.1625 26.1314 5.4222 21.2248 131.7574 41.3475 146.4737 0.0017 0.0630 86.4188 0.3127 0.8794 66.1114 2.4437 327.2576 413.4914 33.6003 240.0983 17.1081 10.4717 111.4034 9.1503 127.3304 5.7493 11.9541 31.1914 16.0715 98.3616 90.1345 114.0349 102.0406 359.5593 334.5282 54.1836 53.3536 11.7968 31.9865 23.4962 17.2576 17.1232 1.0304 1.1726 93.8764
temp: 298.150 k
press: 1.00000 atm
elementType: 17 8 8 8 8 8 6 6 6 6 6 6 6 6 6 6 1 1 1 1 1 1 1 1 1 1 1
symmnumber: 1
zpe: 515483.8 jmol-1
zpe.correction: 0.196337 hartree
zpe.thermalcorrener: 0.211903 hartree
zpe.thermalcorrenthalpy: 0.212847 hartree
zpe.thermalcorrgfe: 0.153007 hartree
zpe.sumelectzpe: -1222.608187 hartree
zpe.sumelectthermal: -1222.592622 hartree
zpe.sumelectthermalent: -1222.591678 hartree
zpe.sumelectthermalfe: -1222.651517 hartree
dipole: 7.1841 3.4678 0.0019
dipole: 7.9773
quadrupole: -93.3930 -98.5263 -100.4927
quadrupole: -12.7747 0.0281 0.0336
quadrupole: 4.0777 -1.0556 -3.0220 -12.7747 0.0281 0.0336
hfenergy: -1222.8045245 hartree
pointgroup: C01 [X(C10H11Cl1O5)]
dipole: -2.8127787 1.3817505 0.1711325 debye
polarizability: 220.8656|-1.7390597|156.0152029|-1.650174|9.4949086|67.5145499 unknown
InChI: InChI=1S/C10H11ClO5/c1-15-7-3-5(12)8(6(13)4-11)10(16-2)9(7)14/h3,12,14H,4H2,1-2H3
charge 0 multiplicity 1
27 atoms
Cl 4.948872 -0.133591 -0.006947
O  0.980105 1.887875 0.236319
O  -3.473107 0.023343 0.087123
O  0.385998 -2.912188 -0.265745
O  -1.973689 2.157921 0.295435
O  2.638178 -1.908021 -0.181819
C  0.727435 -0.481426 -0.010799
C  0.095981 0.815072 0.132795
C  -0.128924 -1.648526 -0.126013
C  -1.307902 0.920597 0.158561
C  -2.100568 -0.261387 0.042182
C  -1.536627 -1.533143 -0.098544
C  2.180907 -0.70663 -0.048359
C  3.176308 0.445522 0.069188
C  0.530556 3.289225 0.388575
C  -4.415708 -1.096777 -0.026128
H  -2.128454 -2.445571 -0.18816
H  3.042609 1.1691 -0.747486
H  3.054994 0.976036 1.024344
H  1.427559 -2.808848 -0.265376
H  -2.950063 1.965398 0.282619
H  1.469114 3.862286 0.442168
H  -0.057801 3.414483 1.310444
H  -0.071304 3.604262 -0.477549
H  -4.272337 -1.811062 0.80502
H  -4.290602 -1.612931 -0.995348
H  -5.414828 -0.642516 0.034201
