program: Gaussian 09
title: 000259228
version: EM64L-G09RevD.01
frameworkgroup: C1[X(C11H13N5)]
method: RPBEPBE
basis: SDD
operation: Freq
keyword: #pfreq=noraman
keyword: PBEPBE/SDD
title: #p freq=noraman PBEPBE/SDD
converged: YES YES NO NO
title: Mulliken charges:
elementType: N N N N N C C C C C C C C C C C H H H H H H H H H H H H H
charge: -0.515602 -0.114858 -0.062049 -0.621047 -0.593064 0.414558 0.481086 0.213760 -0.520199 -0.462441 -0.453595 -0.185432 0.146350 -0.815853 -0.389704 0.000295 0.293703 0.257109 0.221862 0.230656 0.220185 0.228215 0.231386 0.222582 0.248644 0.347276 0.323336 0.324307 0.328534
chargesum: 0.00000
title: Mulliken charges with hydrogens summed into heavy atoms:
elementType: N N N N N C C C C C C C C C C C
charge: -0.221899 -0.114858 -0.062049 0.049565 0.059776 0.414558 0.481086 0.213760 -0.263090 -0.240579 -0.222939 0.034753 0.146350 -0.133669 -0.141060 0.000295
polarizability: 2.38307314e+02 -1.10035649e+01 1.40456653e+02 1.57817354e+01 4.93783841e+00 1.06962614e+02
1716.lowfreq: -9.5388 -0.0008 -0.0006 -0.0005 7.8599 10.3990 17.2677 27.7728 45.2390
frequency: 16.4148 27.6782 45.0670 57.4257 118.6117 188.9987 208.8479 215.2027 243.3612 296.4413 302.3287 341.1496 371.3266 378.4521 431.7529 438.5426 450.9644 476.4698 490.8991 516.0072 530.1637 532.2926 545.7430 563.8770 580.8425 620.0885 694.6708 699.2984 728.4812 758.2416 777.3488 780.2745 815.1700 864.0129 885.3440 910.0578 927.3232 938.5585 963.0939 982.4769 982.9043 1013.0387 1046.2896 1094.4995 1130.8828 1170.5108 1178.2347 1232.0934 1285.7515 1288.5508 1301.4590 1311.5648 1321.4081 1386.0703 1395.0966 1421.9558 1453.6831 1457.0889 1473.3290 1478.1052 1481.6883 1501.7415 1532.5795 1574.0127 1598.8900 1603.0436 1614.1723 1626.9577 2974.2860 3055.4592 3085.3214 3110.3403 3123.4854 3128.3608 3135.7938 3151.9161 3537.1929 3545.0931 3565.3536 3699.4738 3725.7046
redmass: 1.0330 5.0058 3.9789 4.7004 4.9187 4.2043 3.0995 5.4633 4.2895 4.4137 3.1841 3.4034 2.9210 1.2275 1.4739 2.2541 1.9629 1.5052 2.6808 4.6889 1.1513 1.2867 3.8158 3.9336 6.1455 5.7826 2.2322 5.9075 6.6377 6.0335 1.8941 4.4563 5.7527 1.3228 1.4244 3.3160 1.5577 2.1587 1.3273 5.7430 1.7076 1.6655 1.5577 1.6119 2.0827 1.9532 1.0783 3.4210 1.5157 2.9122 2.1282 2.4576 2.4745 5.7303 1.2242 2.7607 2.0128 2.8701 1.0614 3.0789 1.4065 2.5484 2.9525 3.2410 4.1802 1.8618 2.5850 2.6995 1.0385 1.0951 1.0997 1.0870 1.0927 1.0904 1.0908 1.0990 1.0757 1.0442 1.0439 1.1053 1.1059
irintensity: 0.4139 1.1042 0.3077 1.2734 1.5029 7.5517 4.0735 9.1542 1.2786 2.6786 4.9379 10.0987 3.5011 30.5196 256.3651 31.8745 16.7018 268.9871 41.9403 1.9616 26.0114 40.5072 7.5016 1.6609 3.0421 2.3281 18.0296 7.9980 1.8008 2.0429 46.8001 52.1014 4.3618 0.1868 6.6273 4.4874 5.9827 10.2736 0.7886 6.2776 3.9170 10.1234 14.3665 6.3622 12.4576 3.0851 8.5391 8.7090 10.1172 21.3205 36.3854 60.5254 7.4483 34.7638 15.1330 26.8210 80.3352 86.5677 11.8818 387.3847 16.3749 209.1635 96.2202 10.1566 18.3994 666.7491 230.2674 177.1015 33.8266 22.7641 21.1863 8.6333 19.2766 21.4905 17.0520 26.9831 25.9234 77.5106 127.2597 52.6100 46.2829
temp: 298.150 k
press: 1.00000 atm
elementType: 7 7 7 7 7 6 6 6 6 6 6 6 6 6 6 6 1 1 1 1 1 1 1 1 1 1 1 1 1
symmnumber: 1
zpe: 607144.8 jmol-1
zpe.correction: 0.231249 hartree
zpe.thermalcorrener: 0.246224 hartree
zpe.thermalcorrenthalpy: 0.247168 hartree
zpe.thermalcorrgfe: 0.187426 hartree
zpe.sumelectzpe: -699.610256 hartree
zpe.sumelectthermal: -699.595281 hartree
zpe.sumelectthermalent: -699.594337 hartree
zpe.sumelectthermalfe: -699.654080 hartree
dipole: 0.2265 0.3061 1.8327
dipole: 1.8718
quadrupole: -85.2312 -84.4592 -94.6840
quadrupole: -5.7824 -0.1036 0.1389
quadrupole: 2.8936 3.6656 -6.5592 -5.7824 -0.1036 0.1389
hfenergy: -699.8415053 hartree
pointgroup: C01 [X(C11H13N5)]
dipole: -0.007658 0.4534855 0.5801971 debye
polarizability: 232.5777123|-31.1747678|122.2320321|-11.0147722|-13.9612521|130.9168372 unknown
InChI: InChI=1S/C11H13N5/c1-7-3-2-4-8(5-7)15-9-6-14-11(13)16-10(9)12/h2-6,15H,12-13H2,1H3
charge 0 multiplicity 1
29 atoms
N  -0.141436 1.084639 -1.041434
N  2.863132 -0.131789 0.855201
N  3.041875 -0.856662 -1.483828
N  1.035881 1.114173 1.617719
N  4.711364 -1.345433 0.086736
C  -1.424142 0.716284 -0.576771
C  -2.91355 -0.764435 0.724265
C  1.079656 0.410539 -0.73447
C  -1.621355 -0.417658 0.258604
C  -2.549706 1.50769 -0.948172
C  -4.024759 0.029837 0.343341
C  -3.833844 1.156344 -0.491365
C  1.663639 0.463174 0.58272
C  -3.095247 -1.96909 1.633611
C  1.829249 -0.273373 -1.712598
C  3.497132 -0.756808 -0.186786
H  -0.110701 1.797925 -1.771522
H  -0.764094 -1.047086 0.523149
H  -2.411733 2.384881 -1.593227
H  -5.029806 -0.234901 0.690803
H  -4.69515 1.76499 -0.790372
H  -2.423383 -2.797922 1.347477
H  -2.866149 -1.711098 2.686028
H  -4.133336 -2.343306 1.603705
H  1.441156 -0.350464 -2.735859
H  0.116767 1.529237 1.486939
H  1.484941 1.117808 2.53067
H  5.088495 -1.297897 1.028494
H  5.2064 -1.815397 -0.665658
