program: Gaussian 09
title: 000259235
version: EM64L-G09RevD.01
frameworkgroup: C1[X(C15H8Cl2N2O2)]
method: RPBEPBE
basis: SDD
operation: Freq
keyword: #p
keyword: freq=noraman
keyword: PBEPBE/SDD
title: #p freq=noraman PBEPBE/SDD
converged: YES YES NO YES
title: Mulliken charges:
elementType: Cl Cl O O N N C C C C C C C C C C C C C C C H H H H H H H H
charge: -0.042877 -0.042879 -0.168361 -0.215572 -0.406107 -0.400471 -0.224703 0.374738 0.374955 0.184982 0.184969 0.154212 -0.399106 -0.399112 0.179245 -0.380114 -0.380110 -0.116289 -0.116303 -0.215712 -0.215729 0.328988 0.282416 0.282397 0.355806 0.250320 0.250319 0.260049 0.260049
chargesum: 0.00000
title: Mulliken charges with hydrogens summed into heavy atoms:
elementType: Cl Cl O O N N C C C C C C C C C C C C C C C
charge: -0.042877 -0.042879 -0.168361 -0.215572 -0.077119 -0.044665 -0.224703 0.374738 0.374955 0.184982 0.184969 0.154212 -0.116690 -0.116714 0.179245 -0.129793 -0.129790 -0.116289 -0.116303 0.044337 0.044320
polarizability: 3.04689617e+02 1.81937199e-04 2.16869592e+02 6.68950331e-04 -7.94487179e+00 1.04541762e+02
1716.lowfreq: -6.9325 -4.1802 -2.8018 -0.0030 -0.0025 -0.0025 37.5155 44.2853 66.5000
frequency: 37.5073 44.2829 66.4991 77.0893 103.2452 105.4556 150.1841 181.1203 214.7797 219.7000 232.8703 261.9802 292.1930 293.3723 360.1331 366.4745 390.9110 415.1902 434.3543 461.1642 508.5827 513.9361 540.3422 546.4246 566.3466 597.9541 602.2346 631.8946 650.8674 667.2257 693.7955 710.7515 718.0106 733.7109 757.7636 784.7881 789.5303 825.7808 853.3105 897.4221 899.5010 941.5407 956.3423 959.1872 959.7419 980.3017 997.2231 1061.9497 1063.4263 1083.7383 1125.5943 1131.2241 1174.2874 1176.9824 1202.4531 1234.9830 1260.7455 1295.0991 1306.7185 1314.5527 1362.0248 1367.6518 1373.0004 1412.9587 1425.2261 1444.8996 1481.6417 1588.4985 1588.6111 1608.4294 1611.6385 1689.7007 1725.1652 3144.4522 3146.9543 3160.4075 3160.7865 3173.8603 3174.3907 3585.2681 3604.6047
redmass: 11.5506 12.7251 6.8330 9.1162 14.7765 5.6325 7.6426 6.4608 7.6106 7.4666 13.0850 8.5299 7.1358 7.5746 6.7699 4.7703 13.2944 7.1277 3.1668 2.4481 1.4267 5.6546 4.1857 7.6977 3.5911 4.2092 11.1894 4.8324 1.7899 3.1480 6.1582 9.7871 5.6055 7.1366 4.9248 2.5366 6.1145 1.3223 1.9749 1.5319 1.4485 7.2798 3.5215 1.4198 1.6181 3.3376 7.0878 2.2082 1.8268 4.4807 1.7999 1.7024 2.4997 5.6056 3.1795 1.6605 1.3030 2.1202 3.6834 2.1688 1.7174 10.9631 3.6042 3.8053 4.7285 2.4739 4.4636 8.1805 8.4818 7.8734 7.3732 8.7448 9.7813 1.0899 1.0898 1.0934 1.0935 1.0961 1.0963 1.0802 1.0804
irintensity: 0.3909 0.0036 0.5124 0.3794 0.2680 0.0278 1.7740 0.0156 0.2616 0.2955 0.3518 3.5361 0.0283 1.8651 4.8464 0.1917 28.8351 11.9485 23.6497 15.3185 66.3412 1.7055 5.2788 1.0026 1.0197 2.4301 8.8435 8.2316 61.7696 82.1857 18.8878 84.1543 5.6743 1.3963 13.6027 0.0000 9.1451 83.0857 0.2043 11.9232 0.4248 30.2703 4.7268 0.1257 1.8342 35.8394 8.4667 0.9715 54.5215 17.8227 3.9443 1.0969 45.8335 104.7093 43.9888 1.8611 19.1890 5.9737 232.6756 46.5274 6.0288 5.4329 1.5532 70.4846 6.9374 109.8083 4.4809 2.2545 18.6096 16.3753 2.1847 566.6703 408.4437 2.9316 8.9529 0.2336 0.1954 2.0913 6.1617 91.9285 48.8467
temp: 298.150 k
press: 1.00000 atm
elementType: 17 17 8 8 7 7 6 6 6 6 6 6 6 6 6 6 6 6 6 6 6 1 1 1 1 1 1 1 1
symmnumber: 1
zpe: 515919.1 jmol-1
zpe.correction: 0.196503 hartree
zpe.thermalcorrener: 0.213273 hartree
zpe.thermalcorrenthalpy: 0.214217 hartree
zpe.thermalcorrgfe: 0.150880 hartree
zpe.sumelectzpe: -1755.092819 hartree
zpe.sumelectthermal: -1755.076050 hartree
zpe.sumelectthermalent: -1755.075106 hartree
zpe.sumelectthermalfe: -1755.138443 hartree
dipole: -0.0003 -3.3872 -1.1793
dipole: 3.5866
quadrupole: -144.3360 -126.8764 -142.3144
quadrupole: 0.0005 0.0006 8.3419
quadrupole: -6.4937 10.9659 -4.4721 0.0005 0.0006 8.3419
hfenergy: -1755.2893227 hartree
pointgroup: C01 [X(C15H8Cl2N2O2)]
dipole: -0.0005675 -1.3328293 0.4633714 debye
polarizability: 304.6895943|-0.0449811|216.8622742|0.0036744|7.9965945|104.5491026 unknown
InChI: InChI=1S/C15H8Cl2N2O2/c16-7-1-3-9-10-4-2-8(17)6-12(10)15(11(9)5-7)13(20)18-14(21)19-15/h1-6,18-19H
charge 0 multiplicity 1
29 atoms
Cl 5.254071 -0.578701 0.206263
Cl -5.254589 -0.573536 0.206304
O  0.000587 1.233514 -2.422208
O  0.002021 4.216728 1.23034
N  0.000911 1.837866 1.102288
N  0.001418 2.985368 -0.822198
C  0.00041 0.789324 0.072084
C  1.194148 -0.17811 0.106586
C  -1.194273 -0.176934 0.1066
C  0.737292 -1.525653 0.068852
C  -0.738744 -1.524925 0.068855
C  0.000906 1.655899 -1.248741
C  2.558755 0.139436 0.146603
C  -2.558569 0.141946 0.146626
C  0.000911 3.134102 0.603513
C  1.668773 -2.584412 0.058603
C  -1.671266 -2.582768 0.05861
C  3.470013 -0.939491 0.145179
C  -3.470888 -0.936084 0.145198
C  3.051514 -2.286469 0.097163
C  -3.053714 -2.283473 0.09718
H  0.001152 1.647512 2.102705
H  2.9135 1.173728 0.179619
H  -2.912308 1.176581 0.179659
H  0.001969 3.790892 -1.448698
H  1.342528 -3.628856 0.023228
H  -1.346043 -3.627529 0.023234
H  3.79554 -3.088089 0.092767
H  -3.798523 -3.084366 0.092792
