program: Gaussian 09
title: 000259227
version: EM64L-G09RevD.01
frameworkgroup: C1[X(C6H8N2O3)]
method: RPBEPBE
basis: SDD
operation: Freq
keyword: #pfreq=noraman
keyword: PBEPBE/SDD
title: #p freq=noraman PBEPBE/SDD
converged: YES YES NO NO
title: Mulliken charges:
elementType: O O O N N C C C C C C H H H H H H H H
charge: -0.274277 -0.244599 -0.244813 -0.393685 -0.353288 0.226201 -0.391919 0.106784 -0.225658 0.159343 -0.509384 0.229349 0.249074 0.291065 0.364043 0.349514 0.215131 0.236655 0.210463
chargesum: 0.00000
title: Mulliken charges with hydrogens summed into heavy atoms:
elementType: O O O N N C C C C C C
charge: -0.274277 -0.244599 -0.244813 -0.029642 -0.003774 0.226201 0.086504 0.106784 0.065407 0.159343 0.152866
polarizability: 1.11785806e+02 1.01521488e+01 9.71196064e+01 -4.86661268e+00 2.67340593e+00 5.20348992e+01
1716.lowfreq: -5.0329 0.0002 0.0003 0.0004 6.4556 10.5111 40.3107 74.4181 120.7805
frequency: 40.1536 74.4076 120.7797 148.5687 167.3336 210.4430 289.7089 303.8455 368.4271 408.4562 415.5076 510.4833 520.6469 598.8170 640.9347 699.9814 725.8924 749.6597 774.9605 784.6530 855.5513 921.4108 945.4254 995.3946 1051.2078 1105.3376 1116.5646 1155.3417 1170.4208 1220.0597 1245.6622 1305.7882 1339.9312 1364.8263 1388.7450 1433.5709 1446.5345 1457.4105 1460.0759 1475.5664 1611.9091 1658.6961 1683.5117 2942.0293 2978.0355 3021.3270 3050.9770 3108.5755 3171.7888 3525.0622 3564.6156
redmass: 3.5767 3.8026 2.9346 1.8403 7.7366 2.1989 3.8375 5.7513 6.6287 2.9853 3.2778 6.6952 7.7257 5.9290 1.2752 1.9948 4.4193 6.1319 3.5478 2.9177 5.1077 1.4141 2.9099 2.0406 3.9712 2.4705 1.3940 1.5172 2.3276 3.1529 1.3165 1.6556 1.8106 1.6185 2.1609 1.1522 2.4841 1.0627 1.0803 1.0540 6.4899 6.4986 5.7215 1.0332 1.0620 1.1029 1.1006 1.0987 1.0942 1.0771 1.0786
irintensity: 7.1151 0.7194 3.6852 1.6581 2.9683 9.7918 5.1324 2.8862 13.9573 9.0346 18.6306 21.9725 7.2725 13.8531 81.4206 4.3485 23.9636 9.8463 42.7304 104.5868 10.4201 16.1817 8.1888 26.6631 85.1358 0.8936 0.5058 9.8673 83.1532 19.7733 6.7205 35.3335 32.4703 8.6928 65.8720 3.0179 48.6476 1.5514 18.0112 7.1531 156.3860 223.8576 724.6104 59.1327 24.1710 60.7730 13.2908 28.3137 0.1480 54.6969 85.9642
temp: 298.150 k
press: 1.00000 atm
elementType: 8 8 8 7 7 6 6 6 6 6 6 1 1 1 1 1 1 1 1
symmnumber: 1
zpe: 378767.7 jmol-1
zpe.correction: 0.144265 hartree
zpe.thermalcorrener: 0.154644 hartree
zpe.thermalcorrenthalpy: 0.155588 hartree
zpe.thermalcorrgfe: 0.107500 hartree
zpe.sumelectzpe: -567.799170 hartree
zpe.sumelectthermal: -567.788791 hartree
zpe.sumelectthermalent: -567.787847 hartree
zpe.sumelectthermalfe: -567.835935 hartree
dipole: 1.8608 -3.0750 0.2929
dipole: 3.6061
quadrupole: -76.3373 -64.8809 -62.7966
quadrupole: -2.8450 5.8469 0.0189
quadrupole: -8.3324 3.1241 5.2083 -2.8450 5.8469 0.0189
hfenergy: -567.943435 hartree
pointgroup: C01 [X(C6H8N2O3)]
dipole: -0.6952954 -1.1053387 -0.5546847 debye
dipolederiv: -0.8333435 -0.0322858 -0.1445768 -0.1013224 -0.3648517 -0.0546902 -0.3095442 -0.0231392 -0.6325772 -0.5658309 0.08258 0.1014991 0.2179028 -1.0496512 -0.3279029 0.1495488 -0.2565648 -0.5094372 -1.3284769 0.0602263 0.3881272 -0.0081513 -0.4710421 -0.0244462 0.3985048 -0.0523285 -0.5605985 -0.934366 0.3083883 0.3228395 0.3281887 -0.5457173 -0.2169734 0.3566723 -0.1918263 -0.5453819 -1.1382728 0.2386391 0.3874607 -0.5172235 -0.4722162 0.15814 0.1829232 -0.1570746 -0.4219067 -0.2063712 -0.146964 -0.0686128 0.1193468 -0.7346898 -0.2859479 -0.0260971 -0.1133401 -0.1806677 0.7423769 0.0644077 0.0704658 0.1701374 0.285405 0.1317656 0.131287 0.0215235 0.3224644 0.9819486 0.0061373 -0.3075949 -0.155884 1.3403854 0.4458134 -0.3830818 0.3468119 0.5351138 0.6618001 -0.4486467 -0.4091423 -0.1160678 0.3405115 0.1479369 -0.2794581 0.3004155 0.1881885 1.829897 -0.0372657 -0.6137603 0.2674025 0.9759369 0.106529 -0.5521458 0.226556 0.6152899 0.422232 -0.0397542 0.0850836 -0.1671931 0.2390135 -0.0609473 0.2434655 -0.0123292 0.4923946 0.001165 0.040204 -0.0237011 0.0582314 -0.0798604 -0.0398022 -0.0167327 0.0311804 0.0881473 -0.0311939 -0.0091578 0.0051269 -0.0622636 0.0874332 0.0594977 -0.0099767 0.0143111 -0.1074647 0.1214856 -0.0530486 0.0216966 -0.0663341 0.0386309 -0.0209409 0.0125119 -0.0267162 0.1419794 0.1843284 0.0173318 0.0682212 0.0134197 0.2156659 -0.0427321 0.0723179 -0.0465651 0.2968571 0.179636 -0.0307247 0.0609318 -0.0676342 0.2667941 -0.0029836 0.0501268 -0.0202219 0.3238553 -0.0128207 0.089509 -0.0271533 0.1969107 -0.1049889 0.0315043 -0.0137363 -0.0435402 0.0160603 -0.012333 -0.0938557 -0.0725234 -0.1300642 -0.0216767 -0.0610855 -0.0814825 -0.0373011 0.0542591 -0.0618605 -0.0157201 0.1556122 0.0205982 0.054918 0.0572653 0.0748973 0.0401489 -0.1165759 unknown
polarizability: 108.5141348|-1.5230343|88.5691595|-18.6010484|15.9615159|63.8570171 unknown
InChI: InChI=1S/C6H8N2O3/c1-11-3-4-2-7-6(10)8-5(4)9/h2,7-8H,3H2,1H3
charge 0 multiplicity 1
19 atoms
O  -2.921555 -1.08703 0.656925
O  -0.189841 2.220751 1.171028
O  3.180682 -0.197518 -1.019349
N  1.466285 0.982249 0.082187
N  1.157779 -1.268252 -0.502088
C  -0.639078 -0.110348 0.633557
C  -2.025095 -0.091645 1.255448
C  0.171769 1.114551 0.672849
C  -0.116262 -1.24286 0.055847
C  2.027562 -0.156625 -0.51666
C  -3.467043 -0.654098 -0.635376
H  -2.44184 0.934151 1.186462
H  -1.979557 -0.364211 2.32508
H  -0.702058 -2.165115 0.006237
H  2.059586 1.81828 0.094671
H  1.530142 -2.116186 -0.933117
H  -4.051199 0.282361 -0.525465
H  -4.131541 -1.465732 -0.970337
H  -2.669238 -0.492826 -1.389599
