program: Gaussian 09
title: 000259219
version: EM64L-G09RevD.01
frameworkgroup: C1[X(C11H8N2O2)]
method: RPBEPBE
basis: SDD
operation: Freq
keyword: #p
keyword: freq=noraman
keyword: PBEPBE/SDD
title: #p freq=noraman PBEPBE/SDD
converged: NO YES NO NO
title: Mulliken charges:
elementType: O O N N C C C C C C C C C C C H H H H H H H H
charge: -0.205420 -0.205420 0.026415 0.004719 0.384612 0.352859 -0.364002 -0.364003 0.382634 -0.369132 -0.369132 -0.325534 -0.325533 -0.339751 -0.339752 0.253593 0.253593 0.288756 0.288756 0.240176 0.240175 0.245696 0.245696
chargesum: 0.00000
title: Mulliken charges with hydrogens summed into heavy atoms:
elementType: O O N N C C C C C C C C C C C
charge: -0.205420 -0.205420 0.026415 0.004719 0.384612 0.352859 -0.110409 -0.110410 0.382634 -0.080376 -0.080376 -0.085358 -0.085358 -0.094056 -0.094056
polarizability: 2.52529661e+02 1.47527211e-04 1.38301188e+02 5.34487179e-04 6.10279086e-01 6.07325638e+01
1716.lowfreq: -6.4120 -2.9889 0.0003 0.0005 0.0006 0.8357 52.3475 53.9993 78.5422
frequency: 52.3467 53.9989 78.5036 96.8752 163.8703 226.3824 242.4582 300.6869 368.0612 389.8894 410.7372 450.8010 477.6638 514.8174 556.4195 625.2657 635.9909 661.9460 669.6397 726.7203 735.4511 751.5248 796.5063 822.6103 847.4281 870.9254 880.1616 961.0917 965.7805 975.7177 987.2473 992.8576 1000.8326 1021.6350 1064.0285 1091.9271 1094.3173 1114.4949 1185.7962 1219.2765 1229.1017 1288.5216 1294.3492 1303.0682 1326.4799 1359.8058 1386.6575 1410.2046 1417.1461 1459.1790 1492.0574 1541.1716 1585.1235 1592.1088 1608.8289 3134.2599 3135.5897 3152.2093 3154.5126 3158.8624 3163.9916 3185.1660 3187.6747
redmass: 6.3188 8.1075 4.5744 6.7408 6.9841 6.9953 9.6632 6.3005 2.5003 4.8671 2.8972 8.2848 4.6641 5.4884 3.1971 7.0354 8.2726 6.8591 4.4587 7.4724 4.2159 3.0331 8.5386 1.4283 1.2467 1.7373 1.2531 5.8928 1.3680 1.5403 1.3428 1.4170 3.9732 3.5140 2.0616 1.6413 3.0537 1.3220 1.4552 3.1021 1.4176 3.0207 3.0476 1.4480 1.8093 4.6135 3.6091 3.3550 3.3007 1.9037 2.6379 6.9286 5.5528 7.9610 6.2171 1.0868 1.0896 1.0907 1.0904 1.0945 1.0980 1.0948 1.0961
irintensity: 0.0031 3.4854 0.0124 3.6680 0.4955 0.7848 0.0007 3.5907 0.1560 1.9014 0.0304 7.4300 14.3464 2.8293 5.3457 0.1177 1.8609 0.7483 21.1018 32.2358 10.2161 3.9891 15.9524 94.2449 0.0286 27.4021 0.6864 0.8472 0.1024 1.1648 3.5688 0.8213 2.1701 0.9749 6.5786 0.2369 19.7370 15.3198 106.9694 264.1419 69.4810 1.9762 4.7560 0.0226 0.4770 65.8209 57.8819 19.4035 17.4062 15.4816 2.2793 19.4116 49.7229 0.9976 55.8832 12.9085 14.5916 2.9256 2.0840 35.0244 1.0666 0.0057 4.1214
temp: 298.150 k
press: 1.00000 atm
elementType: 8 8 7 7 6 6 6 6 6 6 6 6 6 6 6 1 1 1 1 1 1 1 1
symmnumber: 1
zpe: 440517.4 jmol-1
zpe.correction: 0.167784 hartree
zpe.thermalcorrener: 0.179408 hartree
zpe.thermalcorrenthalpy: 0.180352 hartree
zpe.thermalcorrgfe: 0.128778 hartree
zpe.sumelectzpe: -682.798543 hartree
zpe.sumelectthermal: -682.786919 hartree
zpe.sumelectthermalent: -682.785975 hartree
zpe.sumelectthermalfe: -682.837548 hartree
dipole: -2.8900 -0.0001 -0.0003
dipole: 2.8900
quadrupole: -128.1163 -75.1202 -87.4679
quadrupole: -0.0003 -0.0014 1.7791
quadrupole: -31.2148 21.7813 9.4335 -0.0003 -0.0014 1.7791
hfenergy: -682.9663267 hartree
pointgroup: C01 [X(C11H8N2O2)]
dipole: -1.1369956 0.0000699 -0.0001356 debye
dipolederiv: -0.8237812 -0.1942043 0.0447735 -0.2784476 -0.6394127 0.0970664 0.0641715 0.0945378 -0.2502724 -0.8236973 0.1942392 -0.044746 0.2784491 -0.6394833 0.0969836 -0.0642845 0.0946772 -0.2502829 2.1213151 -0.0000884 0.0000066 -0.0000823 1.0400388 -0.196057 0.0000301 -0.194693 0.2372227 -0.4582737 0.000012 -0.0000016 0.0000103 -0.3178162 -0.0337542 -0.0000034 -0.0249271 -0.2597752 0.5484888 -0.0000406 -0.0000062 -0.0000423 0.0817846 -0.0295936 -0.0000023 -0.0059202 0.02189 0.2931515 -0.0000155 0.000002 -0.0000172 0.1128318 0.0549338 0.0000058 0.0207488 0.0273239 -0.3778205 -0.1513942 0.0507683 -0.2266158 0.0108074 -0.0528365 0.0781129 -0.0434424 -0.120292 -0.3777674 0.1514601 -0.0507794 0.2266909 0.0107374 -0.0528289 -0.0781166 -0.0434383 -0.1202885 -0.9211822 0.0000773 -0.0000234 0.0000834 0.0404577 0.0010575 0.0000154 -0.0023947 0.0514639 0.2407987 0.1161615 -0.0309318 -0.1775874 -0.0284392 -0.0147772 0.0175174 -0.019421 -0.0899662 0.240817 -0.1162101 0.0309199 0.1775628 -0.0284474 -0.0147718 -0.0174467 -0.0194234 -0.0899681 -0.3459193 0.1802947 0.077756 -0.0016252 -0.067739 0.0281485 0.0667989 0.0238509 -0.0794609 -0.3459521 -0.1802454 -0.0777466 0.0016742 -0.0677062 0.0281642 -0.0667897 0.0238671 -0.0794571 0.2793121 -0.2194405 -0.0771407 -0.1125327 0.227763 0.1054758 -0.0708787 0.1116191 -0.0255896 0.2793687 0.2194333 0.0771533 0.1125265 0.2277034 0.1054608 0.0708948 0.1116026 -0.025592 0.046964 0.0837038 -0.0233907 0.0832103 -0.00003 0.042237 -0.0345346 0.0295 0.131325 0.0469339 -0.0837124 0.023397 -0.083226 0.0000012 0.0422347 0.0345207 0.0294995 0.1313227 0.0946667 -0.0544038 0.0140356 -0.0211459 0.0693801 0.0250005 0.0101897 0.0273262 0.163513 0.0946775 0.0544006 -0.0140263 0.021142 0.069367 0.0249996 -0.010182 0.0273326 0.1635129 0.0669283 -0.0986275 -0.0380521 -0.0760249 -0.0059732 -0.0619395 -0.0415036 -0.0511537 0.1207852 0.066961 0.0986142 0.0380433 0.0760119 -0.0060045 -0.0619477 0.041495 -0.0511634 0.1207829 0.02702 0.0778246 0.0286194 0.0816299 -0.0449244 -0.0666313 0.0290273 -0.0692954 0.1109009 0.0269905 -0.0778388 -0.0286298 -0.0816439 -0.044896 -0.0666248 -0.0290374 -0.0692892 0.1109019 unknown
polarizability: 252.5296601|-0.0097444|138.3035716|0.0002334|0.4331606|60.7301813 unknown
InChI: InChI=1S/C11H8N2O2/c14-13(15)11-3-1-9(2-4-11)10-5-7-12-8-6-10/h1-8H
charge 0 multiplicity 1
23 atoms
O  4.576924 1.11199 -0.252707
O  4.576736 -1.112807 0.252622
N  3.970194 -0.000396 -0.000215
N  -4.6951 0.000381 -0.00009
C  -0.332901 -0.000004 -0.00014
C  -1.822074 0.000128 -0.000124
C  0.394994 1.192173 -0.275852
C  0.394784 -1.192313 0.27555
C  2.486887 -0.000262 -0.000185
C  1.800999 1.201745 -0.279181
C  1.800788 -1.202144 0.278832
C  -2.565706 1.142349 0.404302
C  -2.565917 -1.141963 -0.404531
C  -3.976058 1.096055 0.388795
C  -3.97626 -1.09542 -0.388991
H  -0.145645 2.111507 -0.521933
H  -0.146015 -2.111549 0.521644
H  2.372021 2.107251 -0.499113
H  2.371652 -2.107755 0.498744
H  -2.059451 2.046144 0.758073
H  -2.059828 -2.045848 -0.758314
H  -4.56623 1.963625 0.704347
H  -4.566592 -1.962885 -0.704531
