program: Gaussian 09
title: 000259218
version: EM64L-G09RevD.01
frameworkgroup: C1[X(C15H10N2O2)]
method: RPBEPBE
basis: SDD
operation: Freq
keyword: #p
keyword: freq=noraman
keyword: PBEPBE/SDD
title: #p freq=noraman PBEPBE/SDD
converged: NO NO NO NO
title: Mulliken charges:
elementType: O O N N C C C C C C C C C C C C C C C H H H H H H H H H H
charge: -0.268924 -0.256034 -0.310741 -0.009229 0.065936 0.294839 0.244475 0.204226 0.055604 0.009080 -0.325920 -0.355423 -0.399954 -0.328861 0.209054 -0.381081 -0.211094 -0.243195 -0.491557 0.242601 0.302856 0.245201 0.287099 0.242513 0.232680 0.231581 0.242883 0.242633 0.228751
chargesum: 0.00000
title: Mulliken charges with hydrogens summed into heavy atoms:
elementType: O O N N C C C C C C C C C C C C C C C
charge: -0.268924 -0.256034 -0.310741 -0.009229 0.065936 0.294839 0.244475 0.204226 0.055604 0.009080 -0.083319 -0.052566 -0.154753 -0.041762 0.209054 -0.138568 0.021586 -0.011614 0.222710
polarizability: 2.67607748e+02 -1.00968620e+01 2.52541814e+02 3.07952505e-03 -4.96859820e-03 7.26760765e+01
1716.lowfreq: -45.5919 -0.0008 0.0004 0.0006 0.9045 5.3678 10.2648 74.5055 106.2253
frequency: -45.5602 74.5043 106.2232 115.6081 154.6592 154.9200 198.4404 248.4386 274.2258 291.2848 322.1153 339.5722 354.9904 392.9263 438.9590 440.8341 453.9185 470.2626 524.6094 548.2091 588.2447 596.0372 623.7237 627.7237 669.0693 698.8356 732.2345 757.5145 764.6604 768.9211 795.1494 823.2340 840.1829 881.0942 889.4997 895.4572 937.4123 952.4361 961.3801 977.3478 995.6601 1017.1894 1041.2004 1071.6722 1105.2307 1129.0748 1130.9803 1153.2835 1171.1746 1184.2456 1247.4549 1273.1228 1288.0283 1291.8271 1315.1327 1324.7758 1366.3714 1393.8829 1423.0033 1433.8866 1441.3138 1450.3782 1453.6840 1455.7169 1478.5888 1553.1350 1569.6412 1581.2184 1593.7707 1616.3272 1630.2017 3005.1723 3119.2556 3128.1401 3134.6314 3137.2610 3146.8786 3164.4612 3165.6206 3180.5404 3193.5801
redmass: 3.1380 6.4244 5.6431 6.6206 3.6115 4.5224 1.1516 4.4973 4.6256 5.3128 7.7645 5.0401 6.4107 9.7304 3.2214 6.0183 5.4219 9.1436 5.5591 3.3658 4.4424 8.5348 5.5191 6.8664 5.4766 6.3734 10.2418 6.3514 2.0861 2.2182 2.9348 7.2335 1.4267 1.4658 1.4716 8.4794 8.5215 1.4110 1.3886 5.0352 1.3198 2.0718 2.2529 2.8934 1.2364 2.7882 1.6432 1.5533 1.4424 1.5166 2.6872 3.1464 2.1848 3.2085 2.1311 7.3698 3.4143 5.4586 2.0400 3.2563 1.5581 2.2736 1.0525 1.0942 3.9869 8.0268 7.6537 8.3914 7.3570 9.2854 8.5764 1.0280 1.1054 1.1062 1.0863 1.0887 1.0918 1.0968 1.0978 1.0926 1.0962
irintensity: 11.1236 0.3094 0.5524 0.0016 0.1214 0.1925 0.0797 5.4416 4.2709 0.7219 4.2243 5.8117 6.0420 0.9371 6.1549 3.4007 1.0160 3.3854 2.8973 2.8860 0.3016 6.0622 0.6850 4.9870 9.4342 15.5792 2.9078 0.8607 40.5819 29.5993 43.6528 5.7281 11.7249 39.0409 5.4976 3.9763 8.0174 0.3778 4.3796 12.7570 0.7374 7.0810 10.1021 19.1180 0.0413 4.2641 69.7832 9.3957 41.7122 77.7663 141.2488 63.1301 86.7781 35.7913 16.1820 2.4976 22.6434 3.4117 21.9232 67.5353 45.1382 74.0794 12.1717 39.1970 6.9946 270.1303 92.4897 112.5640 14.5065 67.5724 32.5025 63.5351 26.9160 32.7329 0.8170 17.8994 10.6256 19.1756 27.8954 3.4323 3.5747
temp: 298.150 k
press: 1.00000 atm
elementType: 8 8 7 7 6 6 6 6 6 6 6 6 6 6 6 6 6 6 6 1 1 1 1 1 1 1 1 1 1
symmnumber: 1
zpe: 563689.8 jmol-1
zpe.correction: 0.214698 hartree
zpe.thermalcorrener: 0.228036 hartree
zpe.thermalcorrenthalpy: 0.228980 hartree
zpe.thermalcorrgfe: 0.175179 hartree
zpe.sumelectzpe: -836.267695 hartree
zpe.sumelectthermal: -836.254357 hartree
zpe.sumelectthermalent: -836.253413 hartree
zpe.sumelectthermalfe: -836.307215 hartree
dipole: -2.5870 -1.2337 0.0030
dipole: 2.8662
quadrupole: -91.3024 -107.6439 -112.5972
quadrupole: -8.4457 0.0082 -0.0027
quadrupole: 12.5454 -3.7960 -8.7494 -8.4457 0.0082 -0.0027
hfenergy: -836.4823935 hartree
pointgroup: C01 [X(C15H10N2O2)]
dipole: -1.0710161 0.3527067 -0.009339 debye
polarizability: 264.4863299|10.912413|253.629661|8.5529208|17.7476536|74.7096474 unknown
InChI: InChI=1S/C15H10N2O2/c1-19-13-8-11-14-10(6-7-16-11)9-4-2-3-5-12(9)17(14)15(13)18/h2-8H,1H3
charge 0 multiplicity 1
29 atoms
O  3.830847 0.912668 0.377322
O  1.26953 2.413124 0.41806
N  0.1387 0.371483 0.179913
N  1.242891 -3.154346 -0.115839
C  0.158572 -1.016233 0.047526
C  -1.151069 -1.544978 -0.054265
C  -1.234497 0.787731 0.16571
C  -2.054834 -0.387388 0.021606
C  1.335778 -1.784598 0.019774
C  1.320978 1.150378 0.300222
C  -1.237755 -2.948065 -0.192987
C  -1.777669 2.079673 0.267052
C  -3.458335 -0.249223 -0.020021
C  2.577128 -1.06248 0.137988
C  2.577199 0.32523 0.271124
C  -0.013428 -3.683897 -0.216028
C  -3.188737 2.189613 0.222476
C  -4.018125 1.045418 0.081427
C  4.050413 2.368649 0.522846
H  -2.191806 -3.476405 -0.281517
H  -1.129449 2.951396 0.374688
H  -4.104349 -1.126921 -0.128934
H  3.528498 -1.600621 0.123805
H  -0.047976 -4.773916 -0.322403
H  -3.647473 3.181443 0.298876
H  -5.105906 1.168952 0.050741
H  3.581937 2.753491 1.442608
H  3.655906 2.920649 -0.345025
H  5.14733 2.450171 0.575851
