program: Gaussian 09
title: 000259214
version: EM64L-G09RevD.01
frameworkgroup: C1[X(C17H15NO2)]
method: RPBEPBE
basis: SDD
operation: Freq
keyword: #p
keyword: freq=noraman
keyword: PBEPBE/SDD
title: #p freq=noraman PBEPBE/SDD
converged: NO YES NO NO
title: Mulliken charges:
elementType: O O N C C C C C C C C C C C C C C C C C H H H H H H H H H H H H H H H
charge: -0.274328 -0.295387 -0.317155 0.289264 0.279600 -0.646925 0.478705 0.437877 -0.358050 -0.546805 -0.432530 -0.571490 0.203639 0.042446 -0.406542 -0.407424 -0.232843 -0.232785 -0.241716 -0.496553 0.239330 0.239094 0.280926 0.261783 0.269227 0.242712 0.321648 0.243695 0.243721 0.228033 0.228036 0.229868 0.245933 0.211394 0.243601
chargesum: 0.00000
title: Mulliken charges with hydrogens summed into heavy atoms:
elementType: O O N C C C C C C C C C C C C C C C C C
charge: -0.274328 -0.295387 0.004493 0.289264 0.279600 -0.168500 0.478705 0.437877 -0.077124 -0.285023 -0.163303 -0.328778 0.203639 0.042446 -0.162847 -0.163703 -0.004810 -0.004748 -0.011848 0.204374
polarizability: 3.35044696e+02 4.86489007e+01 1.93617808e+02 -1.39428856e-01 6.22349180e-02 1.25811229e+02
1716.lowfreq: -15.0573 -8.4098 -5.2150 0.0005 0.0006 0.0008 3.9123 16.2615 31.0973
frequency: -14.9618 15.7165 31.0916 57.2015 69.9149 116.9787 130.5436 152.4940 171.8217 225.6143 239.9978 262.3823 333.2585 333.8934 338.3543 349.0053 404.0295 410.1075 429.9215 433.3430 475.2620 496.7147 547.0703 556.3266 600.3143 616.9212 617.0172 618.6496 665.1018 693.6413 708.8743 728.4394 752.4361 756.5619 781.0290 818.5494 827.6042 840.6770 857.8738 868.0508 875.4343 884.2036 925.5920 931.4254 938.4790 978.5884 990.2699 995.6943 1020.5090 1028.3978 1074.8636 1081.3339 1103.8640 1124.8310 1171.9941 1175.1110 1184.5524 1188.5664 1212.6480 1215.3424 1236.4934 1258.0215 1277.8776 1285.2681 1315.3501 1327.8218 1367.3550 1373.3465 1382.1582 1437.4815 1439.0304 1439.5852 1444.6607 1451.1110 1464.9600 1484.6718 1490.6201 1513.5272 1552.6422 1573.5854 1592.7725 1611.1373 1614.7889 1629.6205 2969.4686 3006.9456 3014.4080 3119.6434 3120.4546 3122.1048 3127.0656 3135.0653 3140.1830 3146.5371 3159.4416 3164.2985 3175.4020 3192.5633 3568.0317
redmass: 3.1876 4.5009 3.9528 5.1666 4.3642 4.4950 5.7279 1.7144 2.1593 5.0052 4.2839 3.8781 7.2565 2.2047 4.8311 4.7024 2.8228 6.6680 6.4907 3.4079 4.0043 3.4624 4.1739 5.4758 5.8984 4.9884 5.3913 1.2233 5.9431 5.1688 1.6110 5.7903 3.3487 2.3951 3.1364 3.5051 1.4293 1.3362 1.2703 1.6094 3.7602 1.6017 1.5644 5.1748 1.8442 1.3859 6.1422 1.3161 3.9736 2.2579 2.7451 1.5840 1.2379 1.6735 1.0580 2.2893 1.1101 1.1284 2.1729 2.3304 1.7460 1.8757 1.2872 1.9680 2.9948 1.2646 2.2177 3.2120 7.9927 1.5081 2.2511 2.1707 1.0545 1.0808 1.1528 2.3450 5.1820 3.1306 6.8105 3.7909 6.0382 5.6977 6.0941 5.6218 1.0598 1.0280 1.0996 1.0857 1.0883 1.1060 1.1050 1.0913 1.0911 1.0960 1.0902 1.1015 1.0935 1.0941 1.0786
irintensity: 11.4979 0.5591 0.4460 0.5619 0.1367 0.2678 0.3105 0.0187 1.0552 0.4099 13.5888 2.9334 2.9138 6.6788 3.9630 3.9768 0.0024 4.9336 2.3802 0.3468 8.2025 8.2614 0.4506 9.6187 2.3521 5.1398 2.7587 102.4295 22.7677 10.2241 55.4269 0.1059 29.5718 0.1892 16.7320 7.6525 0.4090 0.0026 1.3217 27.4952 5.5566 58.0425 4.7553 23.2634 0.2348 0.0002 0.3916 0.2801 7.5435 4.7667 78.7658 10.8826 0.1154 56.1220 0.0096 199.3980 0.5106 0.4772 28.0376 16.5246 29.3261 6.7773 1.6660 22.8831 50.7739 0.1566 3.6261 71.4703 0.0017 106.7980 40.3731 7.5655 10.5501 79.7293 5.1041 11.0484 156.6775 16.4709 435.0905 22.6091 1.3248 36.4506 14.4437 60.1709 8.3666 93.6374 7.7150 9.4530 2.1071 37.3021 26.6413 12.1862 12.1461 38.5871 6.4529 25.9220 4.6369 0.7603 118.8130
temp: 298.150 k
press: 1.00000 atm
elementType: 8 8 7 6 6 6 6 6 6 6 6 6 6 6 6 6 6 6 6 6 1 1 1 1 1 1 1 1 1 1 1 1 1 1 1
symmnumber: 1
zpe: 724697.6 jmol-1
zpe.correction: 0.276023 hartree
zpe.thermalcorrener: 0.292366 hartree
zpe.thermalcorrenthalpy: 0.293310 hartree
zpe.thermalcorrgfe: 0.230407 hartree
zpe.sumelectzpe: -860.591142 hartree
zpe.sumelectthermal: -860.574798 hartree
zpe.sumelectthermalent: -860.573854 hartree
zpe.sumelectthermalfe: -860.636757 hartree
dipole: 5.2104 6.0076 0.0281
dipole: 7.9524
quadrupole: -112.1258 -109.1682 -114.2926
quadrupole: -2.3499 -0.1696 -0.0716
quadrupole: -0.2636 2.6940 -2.4304 -2.3499 -0.1696 -0.0716
hfenergy: -860.8671643 hartree
pointgroup: C01[X(C17H15N1O2)]
dipole: 1.8855348 1.9196847 1.5963458 debye
polarizability: 326.3655905|35.1175781|170.8653659|48.9751567|36.0996104|157.2427766 unknown
InChI: InChI=1S/C17H15NO2/c1-20-17-8-14-11-18-10-13(15(14)9-16(17)19)7-12-5-3-2-4-6-12/h2-6,8-11,18H,7H2,1H3
charge 0 multiplicity 1
35 atoms
O  -5.183035 0.278417 -0.554758
O  -3.488573 -1.793726 -1.827193
N  0.157074 2.287874 1.505578
C  0.496793 0.314643 0.151577
C  -0.941337 0.227134 -0.082749
C  1.419791 -0.72793 -0.475225
C  -1.796696 1.250301 0.538316
C  2.900472 -0.561272 -0.170068
C  1.002568 1.338232 0.935381
C  -1.540634 -0.769011 -0.859325
C  -1.210539 2.252735 1.317007
C  -3.216411 1.195176 0.328606
C  -3.801192 0.199758 -0.444278
C  -2.970276 -0.863508 -1.095172
C  3.480559 -1.176833 0.969101
C  3.731359 0.223657 -1.010533
C  4.8541 -1.015137 1.261146
C  5.105578 0.3888 -0.723322
C  5.671943 -0.230499 0.415106
C  -5.984635 -0.697753 -1.327817
H  1.258477 -0.709716 -1.571862
H  1.07876 -1.728563 -0.141567
H  2.067957 1.450256 1.141256
H  -0.944398 -1.5491 -1.341977
H  -1.797183 3.037152 1.80105
H  -3.867047 1.950103 0.783762
H  0.563287 3.028739 2.077489
H  2.852561 -1.791817 1.625446
H  3.299138 0.701228 -1.898493
H  5.286005 -1.505506 2.140818
H  5.733147 0.992055 -1.388975
H  6.738243 -0.109237 0.635993
H  -5.68995 -0.704326 -2.388125
H  -7.01756 -0.333958 -1.202375
H  -5.869243 -1.715269 -0.924218
