program: Gaussian 09
title: 000259213
version: EM64L-G09RevD.01
frameworkgroup: C1[X(C17H15NO2)]
method: RPBEPBE
basis: SDD
operation: Freq
keyword: #p
keyword: freq=noraman
keyword: PBEPBE/SDD
title: #p freq=noraman PBEPBE/SDD
converged: YES YES NO NO
title: Mulliken charges:
elementType: O O N C C C C C C C C C C C C C C C C C H H H H H H H H H H H H H H H
charge: -0.319774 -0.420961 0.010138 0.426271 0.276055 -0.715523 0.389568 0.499737 -0.515377 -0.560665 -0.547388 0.205452 -0.544310 0.125774 -0.380777 -0.458395 -0.224347 -0.229300 -0.251315 -0.525050 0.224364 0.235960 0.265424 0.250588 0.259379 0.258260 0.247856 0.234638 0.227952 0.226492 0.229659 0.383148 0.244956 0.229073 0.242437
chargesum: 0.00000
title: Mulliken charges with hydrogens summed into heavy atoms:
elementType: O O N C C C C C C C C C C C C C C C C C
charge: -0.319774 -0.037813 0.010138 0.426271 0.276055 -0.255199 0.389568 0.499737 -0.249953 -0.310077 -0.288008 0.205452 -0.286049 0.125774 -0.132921 -0.223757 0.003605 -0.002808 -0.021656 0.191416
polarizability: 2.13179655e+02 1.23410792e+01 2.40409002e+02 1.55737030e+01 3.77587218e+00 1.36474821e+02
1716.lowfreq: -7.1032 -1.4372 -0.0005 -0.0003 0.0003 4.2158 24.9943 33.6336 41.5109
frequency: 24.8095 33.6024 41.4703 75.4174 117.4991 132.9978 140.6119 189.1988 198.7465 233.1974 253.3548 273.2866 289.0270 310.8290 362.2964 368.2039 404.6591 431.8607 439.1118 460.0021 469.3110 499.3869 523.3165 565.9395 580.4635 582.1089 617.3854 630.5683 658.6348 699.5980 703.5949 714.5481 750.0397 769.5068 791.4463 803.5560 855.1447 858.0808 859.6137 866.7933 897.8486 912.1547 938.2956 950.7773 976.7146 980.1823 990.1803 997.5857 1025.8978 1037.7060 1079.7163 1110.3431 1117.5590 1138.8462 1159.7186 1171.3764 1180.3101 1186.3247 1189.8052 1203.2460 1238.5104 1260.0756 1264.6833 1276.9847 1294.9526 1337.5023 1346.2486 1377.8655 1381.8897 1408.7720 1430.8902 1435.5738 1440.0815 1460.8255 1466.4683 1473.8507 1480.0179 1483.2582 1509.1038 1565.6548 1583.8814 1592.5345 1612.4045 1643.9095 2967.7657 2974.5857 3014.2752 3068.2538 3107.9412 3110.4427 3119.1591 3123.0749 3133.7638 3134.8443 3144.4103 3160.2802 3162.6182 3178.3706 3506.2694
redmass: 4.3650 4.2420 4.7148 4.2171 5.6545 4.7683 3.9480 2.8191 2.9340 1.5795 4.0139 3.3518 3.3110 4.2597 7.6392 4.1787 2.8328 3.6596 3.5846 5.9889 3.8177 1.1628 3.4080 5.0401 4.7400 4.4456 6.3566 5.7026 6.4366 4.6830 2.7602 2.4678 1.9607 2.8539 3.9076 3.2678 1.5396 1.3652 1.4978 2.8538 1.6230 1.5858 1.5931 1.9493 5.4019 1.4086 5.9402 1.3280 2.3179 4.8518 1.6227 3.3658 1.2589 3.3513 1.4386 1.0598 1.5008 1.1886 1.2319 2.2301 1.5211 1.5738 1.7765 3.3069 2.0110 1.3735 1.8540 5.0716 6.9453 2.0969 2.5960 1.4588 2.1229 1.1579 1.0494 1.0924 3.5167 2.1817 3.9242 6.4229 6.7307 6.0674 6.0382 6.9809 1.0598 1.0320 1.0997 1.1047 1.0877 1.0900 1.0929 1.0859 1.0911 1.1011 1.0958 1.0923 1.1014 1.0904 1.0645
irintensity: 0.6910 0.4858 1.0391 0.6336 1.6126 3.4536 1.7015 0.9979 1.0833 0.0701 1.2811 0.0897 0.6465 9.1655 0.5395 0.7521 0.1439 0.9838 2.8880 7.3979 5.7340 135.1962 3.9232 5.7306 16.8472 9.4983 0.6585 17.9160 0.9664 2.7709 21.0533 33.9863 23.9750 9.3703 71.3058 0.1340 15.2642 0.4726 16.4242 11.4588 28.4091 15.6198 9.5215 10.2342 20.0343 0.0822 0.1381 1.0895 12.3336 31.8539 8.8280 3.3363 0.1723 56.0581 52.8195 0.5318 108.3201 26.5505 28.6295 7.8608 40.8483 43.3115 3.9074 186.8239 2.9267 0.8685 6.8836 0.3019 0.3935 25.0461 24.4345 16.6037 7.2063 18.9732 18.6186 76.0356 55.2289 22.9905 156.3789 11.7966 3.8580 1.0029 11.5824 16.0521 26.8384 39.8089 10.8749 32.4079 10.0940 30.5601 17.3499 0.9668 10.8363 20.7406 34.8962 5.3159 24.8387 4.6406 102.2131
temp: 298.150 k
press: 1.00000 atm
elementType: 8 8 7 6 6 6 6 6 6 6 6 6 6 6 6 6 6 6 6 6 1 1 1 1 1 1 1 1 1 1 1 1 1 1 1
symmnumber: 1
zpe: 724313.7 jmol-1
zpe.correction: 0.275877 hartree
zpe.thermalcorrener: 0.292713 hartree
zpe.thermalcorrenthalpy: 0.293657 hartree
zpe.thermalcorrgfe: 0.230252 hartree
zpe.sumelectzpe: -860.599272 hartree
zpe.sumelectthermal: -860.582436 hartree
zpe.sumelectthermalent: -860.581492 hartree
zpe.sumelectthermalfe: -860.644897 hartree
dipole: -3.0517 -5.0699 -1.3544
dipole: 6.0705
quadrupole: -120.9039 -116.1961 -112.5146
quadrupole: 0.7436 0.2995 3.2664
quadrupole: -4.3657 0.3421 4.0236 0.7436 0.2995 3.2664
hfenergy: -860.8751488 hartree
pointgroup: C01[X(C17H15N1O2)]
dipole: 0.5556052 -2.3155314 0.1837757 debye
polarizability: 203.9254512|-6.8379254|244.2124884|22.0194056|11.2742874|141.9255382 unknown
InChI: InChI=1S/C17H15NO2/c1-20-17-9-15-13(7-12-5-3-2-4-6-12)10-18-11-14(15)8-16(17)19/h2-6,8-11,19H,7H2,1H3
charge 0 multiplicity 1
35 atoms
O  -2.45166 -2.369212 -0.558478
O  -4.262013 -0.6481 -1.460186
N  -0.413887 3.718423 0.534556
C  0.437718 1.442297 0.979558
C  -0.733968 0.866906 0.366243
C  1.53659 0.584302 1.590813
C  -1.741382 1.769812 -0.152275
C  2.297861 -0.324728 0.619304
C  -0.947455 -0.546871 0.248364
C  0.5337 2.840804 1.029611
C  -2.928585 1.251215 -0.762758
C  -2.107846 -1.021889 -0.355908
C  -1.510598 3.180718 -0.033216
C  -3.115274 -0.121481 -0.865044
C  2.644559 0.115644 -0.682958
C  2.707313 -1.619664 1.028692
C  3.384316 -0.716604 -1.552294
C  3.449343 -2.455022 0.162246
C  3.79055 -2.005681 -1.134191
C  -1.4898 -3.390809 -0.130631
H  1.114177 -0.041047 2.403347
H  2.263952 1.262888 2.079892
H  -0.182851 -1.2379 0.60993
H  1.40908 3.315071 1.489972
H  -3.69398 1.9282 -1.154573
H  -2.257673 3.886122 -0.419351
H  2.326797 1.110553 -1.016244
H  2.452824 -1.972206 2.036952
H  3.643754 -0.360094 -2.555672
H  3.762519 -3.45024 0.498481
H  4.365578 -2.649738 -1.808804
H  -4.199656 -1.64061 -1.441494
H  -1.940652 -4.353243 -0.411709
H  -1.338797 -3.349626 0.964444
H  -0.521651 -3.25779 -0.648419
