program: Gaussian 09
title: 000259191
version: EM64L-G09RevD.01
frameworkgroup: C1[X(C10H9NO3)]
method: RPBEPBE
basis: SDD
operation: Freq
keyword: #p
keyword: freq=noraman
keyword: PBEPBE/SDD
title: #p freq=noraman PBEPBE/SDD
converged: YES YES NO NO
title: Mulliken charges:
elementType: O O O N C C C C C C C C C C H H H H H H H H H
charge: -0.269116 -0.447726 -0.275881 -0.395069 0.175671 0.221341 0.151190 -0.526936 -0.313279 -0.318463 0.329959 -0.337512 0.092598 -0.537703 0.314372 0.296423 0.286002 0.232736 0.250987 0.241028 0.226073 0.226072 0.377233
chargesum: 0.00000
title: Mulliken charges with hydrogens summed into heavy atoms:
elementType: O O O N C C C C C C C C C C
charge: -0.269116 -0.070494 -0.275881 -0.080697 0.175671 0.221341 0.151190 -0.230514 -0.027277 -0.085727 0.329959 -0.086525 0.092598 0.155470
polarizability: 1.82397557e+02 -1.90409284e+00 1.49677515e+02 -9.90618075e-03 -8.74707755e-03 5.47698455e+01
1716.lowfreq: -6.6245 -2.2555 -0.0006 -0.0004 0.0003 0.3280 68.4529 82.6240 107.6247
frequency: 68.4378 82.6091 107.6247 130.0003 156.6229 211.9161 239.5158 275.9022 317.1945 363.5596 380.3500 413.5692 434.8705 508.7545 542.1162 557.3464 569.6719 587.5242 610.3429 636.4832 655.0211 719.5367 750.0432 770.6738 805.5936 806.3987 846.9769 885.7469 905.5689 938.6867 958.4994 991.0759 1071.2694 1104.1980 1112.4409 1137.7586 1156.4769 1191.1819 1212.6912 1251.3578 1278.1328 1296.1002 1339.5985 1402.5153 1427.3234 1437.5598 1463.5622 1464.5747 1476.1742 1487.2610 1523.4080 1596.5170 1635.6975 1653.1065 2961.4294 3049.3371 3125.0273 3141.6248 3173.0385 3183.8682 3246.2962 3531.1020 3602.5629
redmass: 6.7045 4.2714 6.1848 4.3694 3.7517 3.9550 1.1926 4.9885 6.2110 4.6717 5.9802 7.4037 2.9717 4.4563 1.5074 5.0420 1.3190 5.1778 1.9094 3.1407 5.3110 5.4020 6.6133 3.7619 1.5686 5.5946 1.4735 1.5120 4.9790 1.3329 5.9021 4.0999 2.5370 1.4123 1.2625 1.2019 1.3641 2.3982 1.8441 1.6007 3.9918 2.1078 3.7579 6.2257 1.6174 1.7960 2.4477 1.0492 1.2704 3.6650 5.7234 6.7534 7.5225 7.8042 1.0328 1.1039 1.0998 1.0894 1.0958 1.0922 1.0991 1.0641 1.0811
irintensity: 5.4597 3.1221 2.3571 6.4619 0.0065 4.3996 1.8525 0.3557 4.8175 16.1413 1.9757 10.3800 5.5189 3.6661 130.2382 9.4269 8.8891 20.6630 88.1175 26.8726 31.4256 30.1962 1.7100 7.9254 55.6170 17.6496 14.0563 34.0054 64.0744 0.0793 239.8813 37.2187 104.8150 93.9706 0.1512 6.7558 1.1554 176.7075 1.2041 24.5990 85.0972 29.3352 16.1423 77.2746 23.3290 40.9869 100.4425 13.3576 1.6562 31.1466 71.8021 20.2642 70.0415 351.6980 51.8328 46.2715 28.2138 8.9712 7.5896 4.2559 4.1366 42.1874 74.9692
temp: 298.150 k
press: 1.00000 atm
elementType: 8 8 8 7 6 6 6 6 6 6 6 6 6 6 1 1 1 1 1 1 1 1 1
symmnumber: 1
zpe: 454350.2 jmol-1
zpe.correction: 0.173053 hartree
zpe.thermalcorrener: 0.184990 hartree
zpe.thermalcorrenthalpy: 0.185934 hartree
zpe.thermalcorrgfe: 0.134887 hartree
zpe.sumelectzpe: -665.900396 hartree
zpe.sumelectthermal: -665.888458 hartree
zpe.sumelectthermalent: -665.887514 hartree
zpe.sumelectthermalfe: -665.938561 hartree
dipole: -1.1948 2.8678 -0.0001
dipole: 3.1067
quadrupole: -73.6917 -63.6043 -84.6734
quadrupole: -7.9312 0.0008 -0.0014
quadrupole: 0.2981 10.3855 -10.6836 -7.9312 0.0008 -0.0014
hfenergy: -666.0734487 hartree
pointgroup: C01 [X(C10H9N1O3)]
dipole: -0.4023602 -1.1541565 0.0000237 debye
dipolederiv: -1.0521948 -0.6099586 -0.0000008 -0.7794497 -1.0276289 0.0000114 -0.0000031 0.0000195 -0.302478 -1.5737256 0.1940633 -0.000082 0.0272854 -0.2434482 -0.000008 0.0001459 -0.0000169 -0.4399138 -0.6380931 -0.044571 0.0000318 0.1238176 -1.1460547 0.0001579 -0.0000103 -0.0000721 -0.340335 -0.4007643 0.3711552 -0.0000483 0.0642574 -0.7312488 0.0000407 -0.0000331 0.0000672 -0.2517642 0.4583234 -0.0154143 0.0000443 -0.045293 -0.0190844 0.0000021 0.0000452 0.0000224 0.028888 0.1517746 0.0703215 0.0000136 0.3989197 -0.1048237 0.0000501 -0.0000343 0.0000217 -0.0054067 -0.3161351 0.107299 -0.0000187 0.6080062 -0.849116 0.0001047 -0.0000995 0.0001116 -0.0851352 -0.4364932 -0.1805117 0.0000015 0.0421829 -0.030317 -0.0000187 -0.0000277 -0.0000362 -0.2054698 -0.2159597 -0.2846179 0.0000076 -0.4359709 0.8545378 -0.000132 0.0000329 -0.0000901 -0.0913651 0.2740615 -0.0596228 0.0000487 -0.0010329 0.0764389 -0.0000251 0.0000408 -0.0000342 -0.1662509 1.0096983 0.728484 0.0000052 0.7393872 0.6357421 0.0000175 0.0000293 0.0000219 0.090745 -0.1506075 -0.0379442 0.0000115 -0.3902588 -0.1809427 -0.0000379 0.0000458 -0.0000025 -0.1863692 1.9075317 -0.3844011 0.0000612 -0.6155074 1.6635356 -0.000214 -0.0000451 -0.0000548 0.2352912 0.1984578 -0.0246298 -0.0000102 0.3851944 0.7364142 -0.0000143 -0.000061 -0.0000569 0.3215831 0.164441 0.0495249 -0.0000198 0.0089533 0.2329071 0.0000131 -0.0000113 0.0000174 0.3384319 0.1401928 0.0298471 -0.0000087 -0.0291314 -0.0028554 0.0000179 -0.0000105 0.0000233 0.1735192 0.0510699 -0.0282033 -0.0000102 -0.0422139 0.1036905 0.0000069 -0.0000191 0.0000048 0.2009757 0.0777379 0.0042822 -0.0000102 0.0430767 -0.1112102 0.0000343 -0.0000095 0.0000293 0.1735084 -0.0540202 0.0573426 -0.000029 0.042025 0.0911192 0.0000129 -0.0000263 0.0000152 0.1707849 -0.1177553 -0.130867 -0.0000032 -0.0925807 0.0219903 0.0000047 -0.0000079 0.0000014 0.1223173 0.0723893 0.1144863 0.1173652 -0.0478828 -0.0358732 -0.0272748 0.0677228 -0.0705466 -0.0873722 0.0724229 0.1144398 -0.1173677 -0.0479069 -0.0358421 0.0272437 -0.0676783 0.0705529 -0.0874366 0.3776476 -0.0405041 0.0000183 0.0441227 0.1020696 0.0000069 0.000014 0.0000016 0.3932522 unknown
polarizability: 182.0572779|3.826714|150.0177947|0.0104072|-0.0081445|54.7698455 unknown
InChI: InChI=1S/C10H9NO3/c1-14-6-2-3-9-7(4-6)8(5-11-9)10(12)13/h2-5,11-12H,1H3
charge 0 multiplicity 1
23 atoms
O  3.309604 0.978411 0.000232
O  -3.814846 1.00084 -0.000265
O  -1.911287 2.343835 -0.000283
N  -1.216217 -2.293908 0.000094
C  -0.235861 -0.225252 -0.000015
C  0.030187 -1.632719 0.000162
C  -1.683512 -0.071605 -0.000203
C  0.834972 0.703863 0.0000
C  -2.240795 -1.362011 -0.000089
C  1.345932 -2.146053 0.000356
C  2.147877 0.186573 0.000194
C  2.401939 -1.220786 0.00037
C  -2.411594 1.186285 -0.000444
C  3.125057 2.431604 0.0000
H  -1.342764 -3.304283 0.000182
H  0.613833 1.773406 -0.00014
H  -3.290266 -1.646514 -0.000163
H  1.550375 -3.22186 0.000489
H  3.444382 -1.552399 0.000512
H  4.141568 2.85169 0.00003
H  2.579435 2.767198 0.903222
H  2.579598 2.766929 -0.90342
H  -4.241219 1.899256 -0.000221
