program: Gaussian 09
title: 000259196
version: EM64L-G09RevD.01
frameworkgroup: C1[X(C16H15NO)]
method: RPBEPBE
basis: SDD
operation: Freq
keyword: #p
keyword: freq=noraman
keyword: PBEPBE/SDD
title: #p freq=noraman PBEPBE/SDD
converged: YES YES NO NO
title: Mulliken charges:
elementType: O N C C C C C C C C C C C C C C C C H H H H H H H H H H H H H H H
charge: -0.297262 -0.155124 0.218597 0.315754 -0.535359 -0.421195 -0.313150 -0.238016 0.375588 -0.391141 -0.634753 -0.387749 0.392063 -0.406046 -0.390237 -0.218042 -0.228292 -0.241777 0.258866 0.252102 0.233517 0.248969 0.245010 0.238498 0.230486 0.238214 0.220527 0.218713 0.270376 0.224981 0.224450 0.224612 0.226822
chargesum: 0.00000
title: Mulliken charges with hydrogens summed into heavy atoms:
elementType: O N C C C C C C C C C C C C C C C C
charge: -0.297262 -0.155124 0.218597 0.315754 -0.276493 -0.169093 -0.079633 0.010953 0.375588 -0.146131 0.072445 0.051490 0.392063 -0.135670 -0.165256 0.006408 -0.003679 -0.014955
polarizability: 2.88160329e+02 9.07325850e+00 1.84029081e+02 -2.65205445e+00 2.19274080e+00 8.13543400e+01
1716.lowfreq: -13.1992 -4.4044 -0.0008 -0.0005 -0.0004 2.5099 6.3336 27.4005 58.6139
frequency: -9.0377 27.3725 58.6033 79.4832 87.6937 125.1167 161.1833 183.8823 200.0723 224.2855 233.2517 300.8730 363.8269 401.4313 419.2811 426.0793 467.4404 486.3798 492.8502 581.5719 588.3978 597.4969 617.3546 624.4274 679.0364 702.4167 726.0167 740.1433 757.9513 760.7937 799.6574 802.5166 823.2099 836.1136 855.2890 857.9352 911.3787 932.2970 935.2150 978.9664 989.6766 995.6903 998.0611 1000.8014 1021.5003 1028.0874 1080.5087 1083.5812 1095.2073 1119.1399 1144.4228 1151.7990 1171.3430 1184.7483 1209.1489 1217.9882 1230.0186 1250.7970 1298.9353 1312.5661 1349.0031 1360.5130 1365.7663 1391.2714 1411.2104 1430.7573 1439.5246 1466.7719 1467.5863 1470.5412 1485.9697 1487.3877 1494.1401 1512.8175 1586.4390 1595.6440 1619.3562 1630.3296 2925.7605 2975.0370 2977.1522 3050.7274 3104.6847 3109.9311 3126.0187 3139.7852 3140.1228 3158.7164 3159.9842 3168.9321 3176.6782 3205.8877 3231.9338
redmass: 3.8445 5.1543 4.7529 1.6303 1.6899 3.6740 5.6597 3.4148 3.7481 3.0297 4.2963 3.9761 5.7046 2.8375 4.6854 2.8589 2.9182 5.8561 4.3046 3.4001 5.3595 5.2036 6.3587 3.2634 5.7273 2.2291 1.5581 1.3980 5.5441 2.1020 1.5916 5.5577 4.5386 1.3797 1.2544 1.6124 1.3202 1.3265 3.5863 1.3762 6.1826 1.3342 4.1849 2.2068 1.7369 2.1248 1.3946 1.5248 1.9189 1.3051 1.5540 1.7833 1.0531 1.1125 1.3352 1.6744 2.5130 1.7025 1.6444 1.4548 2.5533 2.4738 4.4271 4.3556 4.7237 1.4159 2.1111 1.0658 2.0354 1.7534 2.4577 1.9314 1.1980 3.7042 7.4445 6.1922 6.0552 7.2596 1.0561 1.0356 1.1033 1.1018 1.0986 1.0877 1.0866 1.0885 1.0930 1.0986 1.0912 1.0959 1.0960 1.0902 1.1064
irintensity: 0.2321 1.2348 0.4694 2.9115 1.9777 0.1777 1.4262 1.9973 1.3354 7.9769 4.7175 0.2380 1.1529 0.3709 4.3462 8.2188 11.0825 0.2477 1.5338 0.0548 1.5154 7.7436 0.0490 2.2981 1.6235 30.9019 49.0050 93.0545 0.4805 11.6467 41.8149 23.0992 12.0020 12.9126 1.0639 38.0058 3.6733 0.0390 10.0406 0.0870 0.0068 1.0460 68.6230 34.2676 2.2545 8.7061 11.6966 18.2917 22.3756 0.6785 29.9781 145.9735 0.3956 4.9771 0.3982 15.3630 201.3876 11.8894 15.0244 8.1769 18.3998 9.0878 13.1203 13.0957 6.4439 59.3536 7.0788 16.8076 32.7599 68.5616 30.7089 125.5367 1.8520 14.4047 26.5466 1.8637 15.7111 49.7431 26.0796 84.3758 32.6637 29.6579 12.5548 10.9863 0.8615 10.2964 33.3648 38.3599 13.7539 7.4437 6.7966 0.8220 5.5507
temp: 298.150 k
press: 1.00000 atm
elementType: 8 7 6 6 6 6 6 6 6 6 6 6 6 6 6 6 6 6 1 1 1 1 1 1 1 1 1 1 1 1 1 1 1
symmnumber: 1
zpe: 697708.1 jmol-1
zpe.correction: 0.265743 hartree
zpe.thermalcorrener: 0.280268 hartree
zpe.thermalcorrenthalpy: 0.281212 hartree
zpe.thermalcorrgfe: 0.223247 hartree
zpe.sumelectzpe: -747.402653 hartree
zpe.sumelectthermal: -747.388128 hartree
zpe.sumelectthermalent: -747.387184 hartree
zpe.sumelectthermalfe: -747.445149 hartree
dipole: 2.6567 0.2502 -0.1011
dipole: 2.6704
quadrupole: -74.8222 -93.6166 -113.5488
quadrupole: -7.3529 0.2780 0.7324
quadrupole: 19.1737 0.3793 -19.5530 -7.3529 0.2780 0.7324
hfenergy: -747.6683957 hartree
pointgroup: C01 [X(C16H15N1O1)]
dipole: -1.045566 0.1025794 0.0084959 debye
polarizability: 288.2289824|-9.4707687|164.1767212|-0.9256934|-40.4350481|101.138046 unknown
InChI: InChI=1S/C16H15NO/c1-17-10-9-14-11-15(7-8-16(14)17)18-12-13-5-3-2-4-6-13/h2-11H,12H2,1H3
charge 0 multiplicity 1
33 atoms
O  0.910399 -0.500418 0.121078
N  -4.666131 -0.068922 0.086981
C  -3.291102 -0.341816 0.160479
C  -2.584363 0.827386 -0.291422
C  -1.161848 0.820168 -0.32179
C  -3.583195 1.814133 -0.638871
C  -2.612577 -1.509528 0.580801
C  -4.831163 1.236742 -0.397261
C  -0.493696 -0.347215 0.099272
C  -1.20903 -1.500758 0.545938
C  -5.731219 -0.999042 0.460038
C  1.713859 0.642978 -0.312419
C  3.186754 0.297157 -0.179392
C  3.625782 -0.817667 0.573198
C  4.14714 1.132676 -0.80402
C  5.007617 -1.088673 0.702688
C  5.527009 0.864544 -0.670536
C  5.962684 -0.249203 0.085299
H  -0.619473 1.704483 -0.667795
H  -3.409651 2.819462 -1.018403
H  -3.150575 -2.399397 0.92441
H  -5.828306 1.653976 -0.532264
H  -0.629628 -2.375163 0.857049
H  -5.670082 -1.266946 1.531587
H  -6.70977 -0.527854 0.275356
H  -5.674202 -1.927652 -0.138067
H  1.466524 1.525785 0.317913
H  1.469958 0.899519 -1.365584
H  2.879927 -1.465893 1.040992
H  3.817485 1.994921 -1.398495
H  5.337446 -1.956505 1.285301
H  6.259135 1.517936 -1.158451
H  7.032994 -0.461017 0.187391
