program: Gaussian 09
title: 000259193
version: EM64L-G09RevD.01
frameworkgroup: C1[X(C11H12N2O2)]
method: RPBEPBE
basis: SDD
operation: Freq
keyword: #p
keyword: freq=noraman
keyword: PBEPBE/SDD
title: #p freq=noraman PBEPBE/SDD
converged: YES YES NO NO
title: Mulliken charges:
elementType: O O N N C C C C C C C C C C C H H H H H H H H H H H H
charge: -0.270727 -0.271694 -0.397575 -0.603376 0.150987 0.299666 0.206445 -0.628325 -0.412956 -0.557783 -0.314765 0.318132 -0.344641 0.188445 -0.537364 0.249817 0.248179 0.271741 0.306086 0.258431 0.230844 0.249969 0.348868 0.325459 0.242918 0.221574 0.221644
chargesum: 0.00000
title: Mulliken charges with hydrogens summed into heavy atoms:
elementType: O O N N C C C C C C C C C C C
charge: -0.270727 -0.271694 -0.091488 0.070951 0.150987 0.299666 0.206445 -0.130329 -0.141215 -0.299353 -0.083921 0.318132 -0.094672 0.188445 0.148772
polarizability: 1.69658641e+02 8.67622327e+00 1.62538766e+02 -1.43467452e+01 6.93171844e+00 8.41186381e+01
1716.lowfreq: -8.5453 -0.9976 -0.0005 0.0002 0.0005 3.1901 32.1403 34.8173 69.2109
frequency: 32.0451 34.8065 69.2004 95.9147 150.9155 158.0567 189.5944 244.5310 249.7103 312.6652 357.3802 382.3835 389.5520 427.8444 458.3642 496.9679 500.5437 516.2874 524.2640 567.0559 584.6241 599.7646 643.8084 655.3574 707.8083 747.2589 767.8113 791.7060 806.5191 820.1182 841.8984 851.4382 902.8227 927.0962 936.9527 993.4181 1053.6934 1060.9164 1098.1174 1112.9468 1134.8336 1155.4240 1170.3539 1200.4227 1235.1814 1253.9045 1280.9753 1309.5126 1318.8760 1340.8885 1395.0814 1422.8685 1437.3807 1443.5819 1462.6287 1465.2902 1477.2755 1480.2673 1556.4588 1573.8749 1594.8606 1633.7244 1641.0216 2955.3551 2998.5002 3040.9143 3050.7122 3122.8580 3137.9882 3161.1797 3172.1286 3219.7410 3507.3350 3613.5000 3665.2977
redmass: 7.8425 4.0773 4.0808 3.7760 3.7152 2.9430 3.9046 1.2257 2.8593 4.2199 6.6735 4.5647 6.2451 2.8538 2.6764 1.3655 3.0242 2.8434 2.3638 1.2256 3.6139 2.7732 3.7066 1.5408 4.7212 4.2433 3.5407 1.7558 1.5757 3.8448 2.4608 2.0645 4.2267 2.4170 1.3308 4.5485 3.1850 1.8411 1.5161 1.2628 1.2354 1.3573 1.3496 2.5357 1.8960 1.4739 2.2515 2.6687 1.8596 3.0137 5.0410 1.9701 1.5040 1.1176 2.7010 1.0524 1.3066 2.9915 5.0254 1.4635 6.4149 7.0801 4.4043 1.0332 1.0608 1.1037 1.0994 1.0992 1.0894 1.0911 1.0956 1.0984 1.0445 1.0810 1.1042
irintensity: 9.3096 1.4864 5.3200 3.9511 0.0484 1.3799 7.7722 1.3557 6.3752 2.0938 13.4725 3.3097 3.3804 6.0552 0.4294 74.5750 17.1594 4.3597 32.6081 193.7798 17.8503 8.6457 14.3575 50.0439 9.3979 1.8304 11.6069 48.4167 24.6113 10.4017 13.2944 19.6553 14.6575 3.9297 0.0148 42.2036 19.4825 8.4142 27.4332 0.1252 2.8073 2.8070 29.9593 130.3675 23.1030 11.4944 36.8426 20.0043 11.0244 85.9921 17.8541 29.0201 12.8506 8.7185 60.5157 13.9645 1.2044 93.6832 12.2034 114.6391 21.6700 37.5038 332.3557 53.9677 19.3576 49.5037 5.5625 28.0160 11.3328 6.2161 7.7701 0.4081 26.4699 68.1597 50.1999
temp: 298.150 k
press: 1.00000 atm
elementType: 8 8 7 7 6 6 6 6 6 6 6 6 6 6 6 1 1 1 1 1 1 1 1 1 1 1 1
symmnumber: 1
zpe: 560404.7 jmol-1
zpe.correction: 0.213447 hartree
zpe.thermalcorrener: 0.227141 hartree
zpe.thermalcorrenthalpy: 0.228085 hartree
zpe.thermalcorrgfe: 0.172020 hartree
zpe.sumelectzpe: -685.250167 hartree
zpe.sumelectthermal: -685.236473 hartree
zpe.sumelectthermalent: -685.235529 hartree
zpe.sumelectthermalfe: -685.291594 hartree
dipole: -1.2904 4.0967 1.5884
dipole: 4.5794
quadrupole: -102.1403 -72.6864 -85.5851
quadrupole: 14.2648 3.6345 0.4130
quadrupole: -15.3364 14.1176 1.2188 14.2648 3.6345 0.4130
hfenergy: -685.4636141 hartree
pointgroup: C01 [X(C11H12N2O2)]
dipole: -0.476551 1.4658586 0.9328364 debye
polarizability: 163.2006991|13.5572187|160.0185718|-24.0939931|15.8287912|93.096774 unknown
InChI: InChI=1S/C11H12N2O2/c1-15-8-2-3-10-9(5-8)7(6-13-10)4-11(12)14/h2-3,5-6,13H,4,12H2,1H3
charge 0 multiplicity 1
27 atoms
O  -2.889561 -1.942416 0.04298
O  3.660444 -2.146418 -1.088269
N  0.329926 2.618206 0.26502
N  2.797909 -1.154422 0.828412
C  0.008331 0.424995 -0.291543
C  1.359462 0.804418 -0.677936
C  -0.611827 1.57873 0.297051
C  2.376399 -0.068062 -1.365489
C  1.510769 2.148893 -0.32224
C  -0.720917 -0.79246 -0.398575
C  -1.940792 1.548201 0.779712
C  -2.045506 -0.815298 0.082011
C  -2.649815 0.342492 0.666184
C  2.994525 -1.220473 -0.536721
C  -2.344151 -3.164168 -0.54891
H  1.948658 -0.549153 -2.265121
H  3.228986 0.537473 -1.72704
H  2.372007 2.801529 -0.456593
H  0.175819 3.564653 0.604402
H  -0.253089 -1.676082 -0.841956
H  -2.414244 2.428769 1.227243
H  -3.681526 0.256504 1.019734
H  2.221029 -0.419369 1.23733
H  3.198863 -1.88233 1.418462
H  -3.154515 -3.905046 -0.483007
H  -1.460725 -3.525952 0.013443
H  -2.065559 -3.008613 -1.609882
