program: Gaussian 09
title: 000259187
version: EM64L-G09RevD.01
frameworkgroup: C1[X(C10H9NO)]
method: RPBEPBE
basis: SDD
operation: Freq
keyword: #p
keyword: freq=noraman
keyword: PBEPBE/SDD
title: #p freq=noraman PBEPBE/SDD
converged: YES YES NO NO
title: Mulliken charges:
elementType: O N C C C C C C C C C C H H H H H H H H H
charge: -0.230404 -0.395395 0.195363 0.243149 0.192948 -0.599363 0.461605 -0.341229 -0.317766 -0.340542 -0.817373 -0.210898 0.243616 0.315863 0.231479 0.289321 0.230584 0.229734 0.229714 0.225834 0.163760
chargesum: 0.00000
title: Mulliken charges with hydrogens summed into heavy atoms:
elementType: O N C C C C C C C C C C
charge: -0.230404 -0.079532 0.195363 0.243149 0.192948 -0.355747 0.461605 -0.109751 -0.028445 -0.109958 -0.132091 -0.047137
polarizability: 1.79187790e+02 2.67820246e+00 1.28819606e+02 -1.63543991e-03 1.26735193e-02 5.13296922e+01
1716.lowfreq: -4.5821 -0.0009 -0.0009 -0.0006 7.1454 7.6234 72.3441 105.3410 133.0815
frequency: 72.3347 105.3347 133.0749 135.1635 209.8200 280.5672 290.3416 351.2594 357.6401 425.1688 446.2354 511.5037 577.7360 600.3127 632.3962 644.0663 734.7774 756.2422 771.7561 805.0287 826.7508 850.2364 892.9677 917.8817 946.1379 976.7298 995.9362 1047.2750 1048.2345 1102.5126 1146.5354 1200.7803 1243.1741 1253.3408 1304.8591 1316.0820 1367.7949 1396.1807 1399.1101 1428.0855 1456.2288 1465.7495 1470.1186 1492.6592 1534.6967 1588.8902 1604.4710 1637.7625 2871.1519 2974.5130 3052.0517 3083.4640 3123.5294 3134.1441 3148.4616 3237.5720 3595.6528
redmass: 1.0485 6.0669 3.0828 5.8590 2.6597 4.0120 3.4197 3.6545 5.4391 2.7696 5.1950 4.2778 2.5138 1.5827 6.9631 2.3063 4.9420 5.7576 3.7119 1.4296 5.0947 1.3745 1.4428 3.4263 1.3376 1.8089 1.5246 2.7860 1.5486 1.4670 1.2858 2.0790 1.7375 2.8484 1.8478 3.4046 1.7345 1.2810 2.8316 2.3461 2.3854 2.6517 1.0459 1.6788 5.4351 6.3131 5.7899 7.1321 1.0838 1.0372 1.0977 1.0986 1.0874 1.0921 1.0973 1.0989 1.0810
irintensity: 0.3189 2.2628 1.9797 3.2062 19.7476 0.1223 10.0136 4.1081 2.7027 14.7482 0.6721 5.6446 24.2549 90.3958 0.5231 3.6283 31.7575 3.0953 0.9081 61.3368 15.9789 13.6079 7.4247 5.1342 1.3299 1.1102 11.3492 1.2858 12.6006 38.7599 0.6322 0.9180 43.4502 5.2325 9.1894 1.0176 68.6202 10.2200 8.6845 23.4044 16.5023 29.0518 13.2555 13.4013 146.9283 99.9043 225.7014 11.2332 96.7173 40.4995 21.9569 17.8040 7.6899 14.9357 18.2611 3.7552 70.5363
temp: 298.150 k
press: 1.00000 atm
elementType: 8 7 6 6 6 6 6 6 6 6 6 6 1 1 1 1 1 1 1 1 1
symmnumber: 1
zpe: 430491.0 jmol-1
zpe.correction: 0.163965 hartree
zpe.thermalcorrener: 0.174130 hartree
zpe.thermalcorrenthalpy: 0.175074 hartree
zpe.thermalcorrgfe: 0.128079 hartree
zpe.sumelectzpe: -515.606605 hartree
zpe.sumelectthermal: -515.596441 hartree
zpe.sumelectthermalent: -515.595497 hartree
zpe.sumelectthermalfe: -515.642491 hartree
dipole: 3.8404 3.6657 0.0007
dipole: 5.3091
quadrupole: -80.5508 -55.4662 -73.9348
quadrupole: -11.9711 0.0091 0.0091
quadrupole: -10.5668 14.5177 -3.9509 -11.9711 0.0091 0.0091
hfenergy: -515.7705705 hartree
pointgroup: C01 [X(C10H9N1O1)]
dipole: 1.5628387 1.3848651 -0.0506159 debye
dipolederiv: -1.3594693 -0.4778763 0.0234693 -0.132173 -0.4851628 0.0047106 0.0168172 0.0094978 -0.3507935 -0.5840104 -0.3824008 0.0126756 -0.0546259 -0.6340971 0.0093945 0.0054653 0.013676 -0.2534996 0.4503898 0.0423377 -0.0064019 0.0997077 -0.1348294 0.002216 -0.0077913 0.0027893 0.0204395 0.2847032 -0.0706887 -0.001889 -0.5071618 -0.0185762 0.0070656 0.0077127 0.0016394 0.0102117 -0.3492518 -0.0874387 0.0054299 -0.7370963 -0.8525656 0.0267457 0.0198954 0.0182951 -0.0802724 -0.1752386 0.0529222 -0.0012313 0.0542053 0.0815281 -0.0065423 -0.0013614 -0.0065606 -0.1808266 0.2042931 -0.1603158 0.0008118 -0.2508992 0.1816511 -0.0016778 0.0029342 -0.0027427 -0.0287879 0.0923698 0.0416826 -0.0040318 0.0547962 0.0529063 -0.0055014 -0.0043425 -0.0053898 -0.1624189 -0.0863801 0.3343557 -0.0075602 0.5009234 0.7361666 -0.0247817 -0.0111393 -0.0226956 -0.0884819 -0.056107 0.0659156 -0.0032145 0.2196544 -0.0897383 -0.0051265 -0.0067844 -0.003269 -0.2007292 -0.0912804 0.1134065 -0.0005889 0.0582694 0.020348 0.0005417 0.0006701 -0.0001965 0.0739696 1.4788114 0.5136315 -0.0291013 0.6475658 1.1146654 -0.0310894 -0.0328467 -0.0296992 0.1052175 0.0763819 -0.0503495 0.0020599 -0.0201607 -0.0819022 0.0054787 0.001371 0.0059572 0.1523239 0.1586062 -0.0477554 0.0033587 -0.0022282 0.2324684 0.0023405 0.0023702 0.0027887 0.33871 0.0714532 -0.0184268 0.0016578 -0.0529954 -0.109502 0.0069666 0.0024366 0.0065288 0.1729823 0.0573189 0.0338339 0.0010933 0.0360264 0.0880611 0.0020457 0.0010044 0.002073 0.2003999 -0.1238385 -0.0545833 0.0046349 -0.0368834 0.0812822 0.0020965 0.0042364 0.0023226 0.1547945 -0.0288586 0.0449001 0.1042879 0.0296131 0.0599762 0.0424344 0.1467918 -0.013507 -0.0496163 -0.0349865 0.0402619 -0.1064926 0.0216334 0.0583648 -0.0479926 -0.1482441 0.0075975 -0.0418078 0.048558 -0.1300975 0.0037105 -0.0046028 -0.1170448 0.0052118 0.0008213 0.0067654 0.1075112 -0.0334643 0.196685 -0.0026782 0.0764317 -0.1839999 0.0054634 -0.0000169 0.0041296 0.1006742 unknown
polarizability: 179.2962208|0.7828436|128.6517394|-1.6306238|-1.7388705|51.3891283 unknown
InChI: InChI=1S/C10H9NO/c1-7-2-3-10-9(4-7)8(6-12)5-11-10/h2-6,11H,1H3
charge 0 multiplicity 1
21 atoms
O  -3.747052 -1.298961 0.081266
N  -0.939783 2.008217 -0.029628
C  -0.14706 -0.138361 0.007922
C  0.243131 1.2414 -0.027615
C  -1.607829 -0.167504 0.027163
C  0.861408 -1.13714 0.017678
C  2.221717 -0.760424 -0.007304
C  1.594627 1.643899 -0.053166
C  -2.042445 1.171069 0.003078
C  2.569351 0.628529 -0.042455
C  3.323628 -1.807333 0.003069
C  -2.479659 -1.336482 0.064558
H  0.594416 -2.199712 0.044789
H  -0.975911 3.026106 -0.051424
H  1.884013 2.700195 -0.080249
H  -3.063375 1.547413 0.007862
H  3.630335 0.905941 -0.061578
H  3.962687 -1.728293 -0.896725
H  3.984443 -1.687309 0.882361
H  2.909922 -2.829895 0.031699
H  -1.946464 -2.320654 0.080599
